LinuxQuestions.org
Welcome to the most active Linux Forum on the web.
Go Back   LinuxQuestions.org > Forums > Linux Forums > Linux - Distributions > Slackware
User Name
Password
Slackware This Forum is for the discussion of Slackware Linux.

Notices


Reply
  Search this Thread
Old 02-17-2018, 07:46 PM   #961
USUARIONUEVO
Senior Member
 
Registered: Apr 2015
Posts: 1,134

Rep: Reputation: 346Reputation: 346Reputation: 346Reputation: 346

arround clemetine and cryptopp6 ..archlinux have a patch for this.

https://git.archlinux.org/svntogit/c...ges/clementine
 
1 members found this post helpful.
Old 02-18-2018, 03:24 AM   #962
Bindestreck
Member
 
Registered: Jul 2011
Location: Sweden
Distribution: Slackware
Posts: 559

Rep: Reputation: 210Reputation: 210Reputation: 210
broadcom-sta not compiling against Linux 4.14: https://slackbuilds.org/repository/1...h=broadcom-sta
 
Old 02-18-2018, 05:38 AM   #963
willysr
Senior Member
 
Registered: Jul 2004
Location: Jogja, Indonesia
Distribution: Slackware-Current
Posts: 3,972

Rep: Reputation: 1230Reputation: 1230Reputation: 1230Reputation: 1230Reputation: 1230Reputation: 1230Reputation: 1230Reputation: 1230Reputation: 1230
Quote:
Originally Posted by Bindestreck View Post
broadcom-sta not compiling against Linux 4.14: https://slackbuilds.org/repository/1...h=broadcom-sta
See here or my repository if the previous branch has been deleted from SBo and pulled into Ponce's repository for -current.

Last edited by willysr; 02-18-2018 at 05:43 AM.
 
Old 02-18-2018, 05:39 AM   #964
Alien Bob
Slackware Contributor
 
Registered: Sep 2005
Location: Eindhoven, The Netherlands
Distribution: Slackware
Posts: 7,494

Rep: Reputation: 5823Reputation: 5823Reputation: 5823Reputation: 5823Reputation: 5823Reputation: 5823Reputation: 5823Reputation: 5823Reputation: 5823Reputation: 5823Reputation: 5823
Quote:
Originally Posted by Bindestreck View Post
broadcom-sta not compiling against Linux 4.14: https://slackbuilds.org/repository/1...h=broadcom-sta
I just uploaded the script and some packages for broadcom-sta: https://slackware.nl/people/alien/sl.../broadcom-sta/
Perhaps those help. All the patches you need are in there.
 
1 members found this post helpful.
Old 02-18-2018, 09:11 AM   #965
Bindestreck
Member
 
Registered: Jul 2011
Location: Sweden
Distribution: Slackware
Posts: 559

Rep: Reputation: 210Reputation: 210Reputation: 210
Quote:
Originally Posted by Alien Bob View Post
I just uploaded the script and some packages for broadcom-sta: https://slackware.nl/people/alien/sl.../broadcom-sta/
Perhaps those help. All the patches you need are in there.
Worked like a charm!
 
Old 02-18-2018, 09:49 AM   #966
sombragris
Member
 
Registered: Jul 2004
Location: Asuncion, Paraguay, South America
Distribution: Slackware
Posts: 437

Rep: Reputation: 196Reputation: 196
Quote:
Originally Posted by USUARIONUEVO View Post
arround clemetine and cryptopp6 ..archlinux have a patch for this.

https://git.archlinux.org/svntogit/c...ges/clementine
Thank you!! It would be great if Ponce adds this to his repository.
 
Old 02-18-2018, 10:10 AM   #967
sombragris
Member
 
Registered: Jul 2004
Location: Asuncion, Paraguay, South America
Distribution: Slackware
Posts: 437

Rep: Reputation: 196Reputation: 196
I can confirm that clementine builds OK with that patch and even after removing the symlink I used as a workaround, it runs perfect. Thanks @USUARIONUEVO for the tip.

Last edited by sombragris; 02-18-2018 at 10:45 AM.
 
Old 02-18-2018, 10:28 AM   #968
ponce
Senior Member
 
Registered: Aug 2004
Location: Pisa, Italy
Distribution: Slackware
Posts: 4,750

Original Poster
Rep: Reputation: Disabled
Quote:
Originally Posted by sombragris View Post
Thank you!! It would be great if Ponce adds this to his repository.
but we don't have cryptopp-6.x on SBo...
 
Old 02-18-2018, 11:41 AM   #969
sombragris
Member
 
Registered: Jul 2004
Location: Asuncion, Paraguay, South America
Distribution: Slackware
Posts: 437

Rep: Reputation: 196Reputation: 196
Quote:
Originally Posted by ponce View Post
but we don't have cryptopp-6.x on SBo...
I understand Ponce. Thanks anyway!
 
Old 02-21-2018, 02:54 PM   #970
brodo
Member
 
Registered: Jan 2004
Location: Poland, Poznan
Distribution: Slackware current 32
Posts: 320

Rep: Reputation: 24
Brlcad does not compile

I just got brlcad scripts from your github , Ponce , but compiling
did not succeed.

Code:
[ 38%] Building CXX object src/libged/CMakeFiles/libged-obj.dir/dag.cpp.o
In file included from /usr/include/c++/7.3.0/ext/string_conversions.h:41:0,
                 from /usr/include/c++/7.3.0/bits/basic_string.h:6349,
                 from /usr/include/c++/7.3.0/string:52,
                 from /usr/include/c++/7.3.0/bits/locale_classes.h:40,
                 from /usr/include/c++/7.3.0/bits/ios_base.h:41,
                 from /usr/include/c++/7.3.0/ios:42,
                 from /usr/include/c++/7.3.0/ostream:38,
                 from /usr/include/c++/7.3.0/iostream:39,
                 from /tmp/SBo/brlcad-7.26.4/include/bn/dvec.h:30,
                 from /tmp/SBo/brlcad-7.26.4/include/brep/ray.h:36,
                 from /tmp/SBo/brlcad-7.26.4/include/brep.h:50,
                 from /tmp/SBo/brlcad-7.26.4/include/./rt/geom.h:47,
                 from /tmp/SBo/brlcad-7.26.4/include/raytrace.h:64,
                 from /tmp/SBo/brlcad-7.26.4/src/libged/ged_private.h:34,
                 from /tmp/SBo/brlcad-7.26.4/src/libged/dag.cpp:804:
/usr/include/c++/7.3.0/cstdlib:75:15: fatal error: stdlib.h: No such file or directory
 #include_next <stdlib.h>
               ^~~~~~~~~~
compilation terminated.
make[2]: *** [src/libged/CMakeFiles/libged-obj.dir/build.make:1215: src/libged/CMakeFiles/libged-obj.dir/dag.cpp.o] Error 1
make[1]: *** [CMakeFiles/Makefile2:10097: src/libged/CMakeFiles/libged-obj.dir/all] Error 2
make: *** [Makefile:163: all] Error 2
bash-4.4#
 
Old 02-22-2018, 11:50 AM   #971
ponce
Senior Member
 
Registered: Aug 2004
Location: Pisa, Italy
Distribution: Slackware
Posts: 4,750

Original Poster
Rep: Reputation: Disabled
Quote:
Originally Posted by brodo View Post
I just got brlcad scripts from your github , Ponce , but compiling
did not succeed.
I asked upstream about this but no answer yet.
any suggestion is welcome.
 
Old 02-22-2018, 12:54 PM   #972
Skaendo
Member
 
Registered: Dec 2014
Location: West Texas, USA
Distribution: Slackware64-14.2
Posts: 881

Rep: Reputation: Disabled
Quote:
Originally Posted by ponce View Post
Quote:
Originally Posted by brodo View Post
I just got brlcad scripts from your github , Ponce , but compiling
did not succeed.
I asked upstream about this but no answer yet.
any suggestion is welcome.
Just a thought on this, seems that brlcad comes with it's own stdlib.h, could using
Code:
    -DBRLCAD_BUNDLED_LIBS=ON \
instead of off include it?
 
Old 02-23-2018, 04:30 AM   #973
Bindestreck
Member
 
Registered: Jul 2011
Location: Sweden
Distribution: Slackware
Posts: 559

Rep: Reputation: 210Reputation: 210Reputation: 210
No luck compiling docker.

The error messages:

Code:
docker-ce-17.09.1-ce/components/packaging/static/hash_files
# WARNING! I don't seem to be running in a Docker container.
# The result of this command might be an incorrect build, and will not be
# officially supported.
#
# Try this instead: make all
#

---> Making bundle: dynbinary (in bundles/17.09.1-ce/dynbinary)
Building: bundles/17.09.1-ce/dynbinary-daemon/dockerd-17.09.1-ce
go build: when using gccgo toolchain, please pass linker flags using -gccgoflags, not -ldflags
# github.com/docker/docker/cmd/dockerd
/tmp/go-build246776567/github.com/docker/docker/vendor/github.com/stevvooe/continuity/libsysx.a(_go_.o): In function `sysx.llistxattr':
/tmp/SBo/docker-ce-17.09.1-ce/build/src/github.com/docker/docker/vendor/github.com/stevvooe/continuity/sysx/xattr_linux_amd64.go:26: undefined reference to `github_com_docker_docker_vendor_github_com_stevvooe_continuity_sysx.use'
/tmp/go-build246776567/github.com/docker/docker/vendor/github.com/stevvooe/continuity/libsysx.a(_go_.o): In function `sysx.lremovexattr':
/tmp/SBo/docker-ce-17.09.1-ce/build/src/github.com/docker/docker/vendor/github.com/stevvooe/continuity/sysx/xattr_linux_amd64.go:48: undefined reference to `github_com_docker_docker_vendor_github_com_stevvooe_continuity_sysx.use'
/tmp/SBo/docker-ce-17.09.1-ce/build/src/github.com/docker/docker/vendor/github.com/stevvooe/continuity/sysx/xattr_linux_amd64.go:49: undefined reference to `github_com_docker_docker_vendor_github_com_stevvooe_continuity_sysx.use'
/tmp/go-build246776567/github.com/docker/docker/vendor/github.com/stevvooe/continuity/libsysx.a(_go_.o): In function `sysx.lsetxattr':
/tmp/SBo/docker-ce-17.09.1-ce/build/src/github.com/docker/docker/vendor/github.com/stevvooe/continuity/sysx/xattr_linux_amd64.go:76: undefined reference to `github_com_docker_docker_vendor_github_com_stevvooe_continuity_sysx.use'
/tmp/SBo/docker-ce-17.09.1-ce/build/src/github.com/docker/docker/vendor/github.com/stevvooe/continuity/sysx/xattr_linux_amd64.go:77: undefined reference to `github_com_docker_docker_vendor_github_com_stevvooe_continuity_sysx.use'
/tmp/go-build246776567/github.com/docker/docker/vendor/github.com/stevvooe/continuity/libsysx.a(_go_.o):/tmp/SBo/docker-ce-17.09.1-ce/build/src/github.com/docker/docker/vendor/github.com/stevvooe/continuity/sysx/xattr_linux_amd64.go:104: more undefined references to `github_com_docker_docker_vendor_github_com_stevvooe_continuity_sysx.use' follow
collect2: error: ld returned 1 exit status
Anyone with better luck?
 
Old 02-23-2018, 04:40 AM   #974
ponce
Senior Member
 
Registered: Aug 2004
Location: Pisa, Italy
Distribution: Slackware
Posts: 4,750

Original Poster
Rep: Reputation: Disabled
I built it a few days ago.
a common error happens when you build google-go-lang: you have to logout, login again and only then build the rest of the queue of the docker dependencies (docker included). google-go-lang install files in /etc/profile/ that make the system use its own go compiler instead of the one shipped with gcc (that's no good for building docker and its dependencies).

Last edited by ponce; 02-23-2018 at 04:48 AM.
 
2 members found this post helpful.
Old 02-23-2018, 05:10 AM   #975
Bindestreck
Member
 
Registered: Jul 2011
Location: Sweden
Distribution: Slackware
Posts: 559

Rep: Reputation: 210Reputation: 210Reputation: 210
That was correct, had to logout and login again. Thanks.
 
  


Reply

Tags
current, sbo, sbopkg, slackrepo


Thread Tools Search this Thread
Search this Thread:

Advanced Search

Posting Rules
You may not post new threads
You may not post replies
You may not post attachments
You may not edit your posts

BB code is On
Smilies are On
[IMG] code is Off
HTML code is Off



Similar Threads
Thread Thread Starter Forum Replies Last Post
[SOLVED] Error building gst1-plugins-good 1.4.1 from SBO l0rddarkf0rce Slackware 4 10-06-2014 05:58 PM
[SOLVED] Failure building nvidia-kernel Slackbuild from SBo sysfce2 Slackware 7 07-02-2011 01:10 AM
problems building fontforge from SBo gtludwig Slackware 7 05-12-2010 01:52 PM
Pls help me take my 1st step! verysoon Fedora - Installation 2 12-12-2005 07:49 AM

LinuxQuestions.org > Forums > Linux Forums > Linux - Distributions > Slackware

All times are GMT -5. The time now is 10:00 PM.

Main Menu
Advertisement
My LQ
Write for LQ
LinuxQuestions.org is looking for people interested in writing Editorials, Articles, Reviews, and more. If you'd like to contribute content, let us know.
Main Menu
Syndicate
RSS1  Latest Threads
RSS1  LQ News
Twitter: @linuxquestions
Facebook: linuxquestions Google+: linuxquestions
Open Source Consulting | Domain Registration