LinuxQuestions.org
Download your favorite Linux distribution at LQ ISO.
Go Back   LinuxQuestions.org > Forums > Linux Forums > Linux - Distributions > Slackware
User Name
Password
Slackware This Forum is for the discussion of Slackware Linux.

Notices


Reply
  Search this Thread
Old 06-27-2017, 10:02 AM   #616
sombragris
Member
 
Registered: Jul 2004
Location: Asuncion, Paraguay, South America
Distribution: Slackware
Posts: 258

Rep: Reputation: 55

Same here. I just built inkscape OK.

Quote:
Originally Posted by willysr View Post
Hi Rob,

i just got the same result as Ponce.
inkscape built fine on latest -current update
 
Old 06-27-2017, 10:04 AM   #617
sombragris
Member
 
Registered: Jul 2004
Location: Asuncion, Paraguay, South America
Distribution: Slackware
Posts: 258

Rep: Reputation: 55
I have problems building texlive once again. This time it looks like it doesn't like harfbuzz.

Relevant output:

Code:
/bin/sh ../../../texk/web2c/web2c/convert xetex
g++ -DHAVE_CONFIG_H -I. -I../../../texk/web2c -I./w2c  -I/tmp/SBo/texlive-20160523-source/build/texk -I/tmp/SBo/texlive-20160523-source/texk -I../../../texk/web2c/xetexdir -I/usr/include  -I/usr/include/freetype2 -I/usr/include/libpng16 -I/usr/include/harfbuzz -I/usr/include/glib-2.0 -I/usr/lib64/glib-2.0/include -I/tmp/SBo/texlive-20160523-source/build/libs/teckit/include -I/tmp/SBo/texlive-20160523-source/build/libs/harfbuzz/include -I/tmp/SBo/texlive-20160523-source/build/libs/graphite2/include -DGRAPHITE2_STATIC -DPOPPLER_VERSION=\"0.56.0\" -I/usr/include/poppler -I/usr/include/libpng16  -I../../../texk/web2c/libmd5  -I/usr/include/freetype2 -I/usr/include/libpng16 -I/usr/include/harfbuzz -I/usr/include/glib-2.0 -I/usr/lib64/glib-2.0/include -I/usr/include/freetype2 -I/usr/include/libpng16 -I/usr/include/harfbuzz -I/usr/include/glib-2.0 -I/usr/lib64/glib-2.0/include   -O2 -fPIC -MT xetexdir/libxetex_a-XeTeXFontInst.o -MD -MP -MF xetexdir/.deps/libxetex_a-XeTeXFontInst.Tpo -c -o xetexdir/libxetex_a-XeTeXFontInst.o `test -f 'xetexdir/XeTeXFontInst.cpp' || echo '../../../texk/web2c/'`xetexdir/XeTeXFontInst.cpp
mv -f xetexdir/.deps/libxetex_a-XeTeXFontInst.Tpo xetexdir/.deps/libxetex_a-XeTeXFontInst.Po
g++ -DHAVE_CONFIG_H -I. -I../../../texk/web2c -I./w2c  -I/tmp/SBo/texlive-20160523-source/build/texk -I/tmp/SBo/texlive-20160523-source/texk -I../../../texk/web2c/xetexdir -I/usr/include  -I/usr/include/freetype2 -I/usr/include/libpng16 -I/usr/include/harfbuzz -I/usr/include/glib-2.0 -I/usr/lib64/glib-2.0/include -I/tmp/SBo/texlive-20160523-source/build/libs/teckit/include -I/tmp/SBo/texlive-20160523-source/build/libs/harfbuzz/include -I/tmp/SBo/texlive-20160523-source/build/libs/graphite2/include -DGRAPHITE2_STATIC -DPOPPLER_VERSION=\"0.56.0\" -I/usr/include/poppler -I/usr/include/libpng16  -I../../../texk/web2c/libmd5  -I/usr/include/freetype2 -I/usr/include/libpng16 -I/usr/include/harfbuzz -I/usr/include/glib-2.0 -I/usr/lib64/glib-2.0/include -I/usr/include/freetype2 -I/usr/include/libpng16 -I/usr/include/harfbuzz -I/usr/include/glib-2.0 -I/usr/lib64/glib-2.0/include   -O2 -fPIC -MT xetexdir/libxetex_a-XeTeXFontMgr.o -MD -MP -MF xetexdir/.deps/libxetex_a-XeTeXFontMgr.Tpo -c -o xetexdir/libxetex_a-XeTeXFontMgr.o `test -f 'xetexdir/XeTeXFontMgr.cpp' || echo '../../../texk/web2c/'`xetexdir/XeTeXFontMgr.cpp
mv -f xetexdir/.deps/libxetex_a-XeTeXFontMgr.Tpo xetexdir/.deps/libxetex_a-XeTeXFontMgr.Po
g++ -DHAVE_CONFIG_H -I. -I../../../texk/web2c -I./w2c  -I/tmp/SBo/texlive-20160523-source/build/texk -I/tmp/SBo/texlive-20160523-source/texk -I../../../texk/web2c/xetexdir -I/usr/include  -I/usr/include/freetype2 -I/usr/include/libpng16 -I/usr/include/harfbuzz -I/usr/include/glib-2.0 -I/usr/lib64/glib-2.0/include -I/tmp/SBo/texlive-20160523-source/build/libs/teckit/include -I/tmp/SBo/texlive-20160523-source/build/libs/harfbuzz/include -I/tmp/SBo/texlive-20160523-source/build/libs/graphite2/include -DGRAPHITE2_STATIC -DPOPPLER_VERSION=\"0.56.0\" -I/usr/include/poppler -I/usr/include/libpng16  -I../../../texk/web2c/libmd5  -I/usr/include/freetype2 -I/usr/include/libpng16 -I/usr/include/harfbuzz -I/usr/include/glib-2.0 -I/usr/lib64/glib-2.0/include -I/usr/include/freetype2 -I/usr/include/libpng16 -I/usr/include/harfbuzz -I/usr/include/glib-2.0 -I/usr/lib64/glib-2.0/include   -O2 -fPIC -MT xetexdir/libxetex_a-XeTeXLayoutInterface.o -MD -MP -MF xetexdir/.deps/libxetex_a-XeTeXLayoutInterface.Tpo -c -o xetexdir/libxetex_a-XeTeXLayoutInterface.o `test -f 'xetexdir/XeTeXLayoutInterface.cpp' || echo '../../../texk/web2c/'`xetexdir/XeTeXLayoutInterface.cpp
In file included from /usr/include/harfbuzz/hb-ot.h:38:0,
                 from ../../../texk/web2c/xetexdir/XeTeXLayoutInterface.cpp:44:
/usr/include/harfbuzz/hb-ot-var.h:91:11: error: 'hb_variation_t' does not name a type; did you mean 'hb_direction_t'?
     const hb_variation_t *variations, /* IN */
           ^~~~~~~~~~~~~~
           hb_direction_t
make[5]: *** [Makefile:13049: xetexdir/libxetex_a-XeTeXLayoutInterface.o] Error 1
make[5]: Leaving directory '/tmp/SBo/texlive-20160523-source/build/texk/web2c'
make[4]: *** [Makefile:13447: all-recursive] Error 1
make[4]: Leaving directory '/tmp/SBo/texlive-20160523-source/build/texk/web2c'
make[3]: *** [Makefile:3820: all] Error 2
make[3]: Leaving directory '/tmp/SBo/texlive-20160523-source/build/texk/web2c'
make[2]: *** [Makefile:901: recurse] Error 1
make[2]: Leaving directory '/tmp/SBo/texlive-20160523-source/build/texk'
make[1]: *** [Makefile:481: all-recursive] Error 1
make[1]: Leaving directory '/tmp/SBo/texlive-20160523-source/build/texk'
make: *** [Makefile:569: all-recursive] Error 1
 
Old 06-27-2017, 10:18 AM   #618
ponce
Senior Member
 
Registered: Aug 2004
Location: Pisa, Italy
Distribution: Slackware
Posts: 3,695

Original Poster
Rep: Reputation: 1796Reputation: 1796Reputation: 1796Reputation: 1796Reputation: 1796Reputation: 1796Reputation: 1796Reputation: 1796Reputation: 1796Reputation: 1796Reputation: 1796
have you checked with texlive's maintainer?
I think it's the best person that can have a look on that.
I think I read somewhere he's also about to update the texlive's version, so maybe that can help too...

EDIT: now I remember where I saw that

https://git.slackbuilds.org/slackbuilds/log/?h=rworkman

I would check first if the updates work

Last edited by ponce; 06-27-2017 at 10:20 AM.
 
1 members found this post helpful.
Old 06-27-2017, 10:21 AM   #619
Didier Spaier
LQ Addict
 
Registered: Nov 2008
Location: Paris, France
Distribution: Slint64-14.2 on Lenovo Thinkpad W520
Posts: 7,527

Rep: Reputation: 2480Reputation: 2480Reputation: 2480Reputation: 2480Reputation: 2480Reputation: 2480Reputation: 2480Reputation: 2480Reputation: 2480Reputation: 2480Reputation: 2480
Johannes has upgraded texlive to version 2017.170622, that should be included in next batch. Maybe check it when it's ready.

EDIT ponce beat me to it.
 
1 members found this post helpful.
Old 06-27-2017, 11:01 AM   #620
sombragris
Member
 
Registered: Jul 2004
Location: Asuncion, Paraguay, South America
Distribution: Slackware
Posts: 258

Rep: Reputation: 55
Quote:
Originally Posted by ponce View Post
EDIT: now I remember where I saw that

https://git.slackbuilds.org/slackbuilds/log/?h=rworkman

I would check first if the updates work
Thanks ponce and Didier! I'll wait till the new updates. I just wanted to rebuild texlive since images no longer appeared in documents.
 
Old 07-19-2017, 04:59 AM   #621
USUARIONUEVO
Member
 
Registered: Apr 2015
Posts: 547

Rep: Reputation: 142Reputation: 142
Hi , after last exiv2 update , libgexiv2 not build.

Easy way is upgrade version 0.10.3 to 0.10.6
 
Old 07-19-2017, 05:09 AM   #622
ponce
Senior Member
 
Registered: Aug 2004
Location: Pisa, Italy
Distribution: Slackware
Posts: 3,695

Original Poster
Rep: Reputation: 1796Reputation: 1796Reputation: 1796Reputation: 1796Reputation: 1796Reputation: 1796Reputation: 1796Reputation: 1796Reputation: 1796Reputation: 1796Reputation: 1796
Quote:
Originally Posted by USUARIONUEVO View Post
Hi , after last exiv2 update , libgexiv2 not build.

Easy way is upgrade version 0.10.3 to 0.10.6
thanks for reporting! It will go in the next update

https://github.com/Ponce/slackbuilds/tree/libgexiv2
 
1 members found this post helpful.
Old 07-19-2017, 03:35 PM   #623
USUARIONUEVO
Member
 
Registered: Apr 2015
Posts: 547

Rep: Reputation: 142Reputation: 142
@ponce

Thanks!
 
Old 07-21-2017, 03:24 PM   #624
brobr
Member
 
Registered: Oct 2003
Location: uk
Distribution: Slackware
Posts: 325

Rep: Reputation: 60
Ok, for those of you who also get the same error during compiling ufraw (after the last batch of current-updates ufraw has to be rebuilt) with gcc 7.1:
Code:
dcraw.cc:9245:25: error: call of overloaded ‘abs(unsigned int&)’ is ambiguous
       if (abs(i) < abs(c)) {
                         ^
In file included from /usr/include/c++/7.1.0/bits/std_abs.h:38:0,
                 from /usr/include/c++/7.1.0/cmath:47,
                 from /usr/include/c++/7.1.0/math.h:36,
                 from dcraw.cc:36:
/usr/include/stdlib.h:751:12: note: candidate: int abs(int)
 extern int abs (int __x) __THROW __attribute__ ((__const__)) __wur;
This error has been noted on the ufraw-forum
https://sourceforge.net/p/ufraw/mail...sage/35843792/
and there is a patch
https://sourceforge.net/p/ufraw/mail...localdomain/1/
and another, mentioned further down in the thread, that might also help
https://src.fedoraproject.org/cgit/r...ned_char.patch

including
Code:
patch --verbose -p1 < $CWD/ufraw-0.22-gcc7-1.patch
patch --verbose -p1 < $CWD/05_fix_build_due_to_unsigned_char.patch
above the "CFLAGS=.."-line in the ufraw.Slackbuild compiled ufraw for me.

HTH

Rob
 
Old 07-21-2017, 03:32 PM   #625
ponce
Senior Member
 
Registered: Aug 2004
Location: Pisa, Italy
Distribution: Slackware
Posts: 3,695

Original Poster
Rep: Reputation: 1796Reputation: 1796Reputation: 1796Reputation: 1796Reputation: 1796Reputation: 1796Reputation: 1796Reputation: 1796Reputation: 1796Reputation: 1796Reputation: 1796
maybe you missed it but I added this to the repository one month ago

http://cgit.ponce.cc/slackbuilds/commit/?h=ufraw

with that ufraw builds fine here.

Last edited by ponce; 07-21-2017 at 03:36 PM.
 
Old 07-21-2017, 04:24 PM   #626
brobr
Member
 
Registered: Oct 2003
Location: uk
Distribution: Slackware
Posts: 325

Rep: Reputation: 60
@ponce

Is this also in the 'master-repository?' I always sync before compiling anything, but did not see the patches or changes in the ufraw.SlackBuild in my local tree after that...

BTW, that patch you include is another one than the two mentioned in my post.. thus could there be (at least) three different bottlenecks (relating to different cameras)?

The ufraw-patch patches an error -thrown in my case- at line 8766
the fedora-patch is for line 2285
and the suse-one you used is for line 9240
 
Old 07-21-2017, 04:43 PM   #627
bassmadrigal
Senior Member
 
Registered: Nov 2003
Location: Newport News, VA
Distribution: Slackware
Posts: 4,040

Rep: Reputation: 2031Reputation: 2031Reputation: 2031Reputation: 2031Reputation: 2031Reputation: 2031Reputation: 2031Reputation: 2031Reputation: 2031Reputation: 2031Reputation: 2031
Quote:
Originally Posted by brobr View Post
Is this also in the 'master-repository?' I always sync before compiling anything, but did not see the patches or changes in the ufraw.SlackBuild in my local tree after that..
No... in a few different ways. First, this is a completely separate repo from SBo's official repo. Second, the master branch within ponce's repo mirrors SBo's master branch (and it is updated when there's public updates on SBo). Third, ponce has a "current" branch which contains all the adjustments to the master branch to allow SlackBuilds to compile on -current. The current branch is the default branch for ponce's repo and the one people should be using when using his repo on -current.
 
Old 07-22-2017, 04:56 AM   #628
brodo
Member
 
Registered: Jan 2004
Location: Poland, Poznan
Distribution: Slackware current 32
Posts: 252

Rep: Reputation: 17
Muse 2.1.2

Hello,
I can't compile Audio > muse (2.1.2) software in my current Slackware.

The error is as follows:




/tmp/SBo/muse-2.1.2/muse/midiedit/ecanvas.cpp:277:86: error: call of overloaded ‘abs(unsigned int)’ is ambiguous
unsigned int neartk=abs(nearest->x() + nearest->part()->tick() - tick);
^
In file included from /usr/include/c++/7.1.0/cstdlib:75:0,
from /usr/include/c++/7.1.0/bits/stl_algo.h:59,
from /usr/include/c++/7.1.0/algorithm:62,
from /usr/lib/qt/include/QtCore/qglobal.h:68,
from /usr/lib/qt/include/QtCore/qnamespace.h:45,
from /usr/lib/qt/include/QtCore/qobjectdefs.h:45,
from /usr/lib/qt/include/QtGui/qwindowdefs.h:45,
from /usr/lib/qt/include/QtGui/qevent.h:45,
from /usr/lib/qt/include/QtGui/QKeyEvent:1,
from /tmp/SBo/muse-2.1.2/muse/midiedit/ecanvas.cpp:31:
/usr/include/stdlib.h:751:12: note: candidate: int abs(int)
extern int abs (int __x) __THROW __attribute__ ((__const__)) __wur;
^~~
In file included from /usr/include/c++/7.1.0/cstdlib:77:0,
from /usr/include/c++/7.1.0/bits/stl_algo.h:59,
from /usr/include/c++/7.1.0/algorithm:62,
from /usr/lib/qt/include/QtCore/qglobal.h:68,
from /usr/lib/qt/include/QtCore/qnamespace.h:45,
from /usr/lib/qt/include/QtCore/qobjectdefs.h:45,
from /usr/lib/qt/include/QtGui/qwindowdefs.h:45,
from /usr/lib/qt/include/QtGui/qevent.h:45,
from /usr/lib/qt/include/QtGui/QKeyEvent:1,
from /tmp/SBo/muse-2.1.2/muse/midiedit/ecanvas.cpp:31:
/usr/include/c++/7.1.0/bits/std_abs.h:56:3: note: candidate: long int std::abs(long int)
abs(long __i) { return __builtin_labs(__i); }
^~~
/usr/include/c++/7.1.0/bits/std_abs.h:61:3: note: candidate: long long int std::abs(long long int)
abs(long long __x) { return __builtin_llabs (__x); }
^~~
/usr/include/c++/7.1.0/bits/std_abs.h:70:3: note: candidate: constexpr double std::abs(double)
abs(double __x)
^~~
/usr/include/c++/7.1.0/bits/std_abs.h:74:3: note: candidate: constexpr float std::abs(float)
abs(float __x)
^~~
/usr/include/c++/7.1.0/bits/std_abs.h:78:3: note: candidate: constexpr long double std::abs(long double)
abs(long double __x)
^~~
/usr/include/c++/7.1.0/bits/std_abs.h:102:3: note: candidate: constexpr __float128 std::abs(__float128)
abs(__float128 __x)
^~~
make[2]: *** [muse/midiedit/CMakeFiles/midiedit.dir/build.make:194: muse/midiedit/CMakeFiles/midiedit.dir/ecanvas.o] Error 1
make[1]: *** [CMakeFiles/Makefile2:1320: muse/midiedit/CMakeFiles/midiedit.dir/all] Error 2
make: *** [Makefile:152: all] Error 2
 
Old 07-22-2017, 05:26 AM   #629
ponce
Senior Member
 
Registered: Aug 2004
Location: Pisa, Italy
Distribution: Slackware
Posts: 3,695

Original Poster
Rep: Reputation: 1796Reputation: 1796Reputation: 1796Reputation: 1796Reputation: 1796Reputation: 1796Reputation: 1796Reputation: 1796Reputation: 1796Reputation: 1796Reputation: 1796
try applying this patch to the SlackBuild files: it lets you build on current the latest version available, 3.0pre2

http://cgit.ponce.cc/slackbuilds/commit/?h=muse
 
Old 07-23-2017, 02:42 AM   #630
brodo
Member
 
Registered: Jan 2004
Location: Poland, Poznan
Distribution: Slackware current 32
Posts: 252

Rep: Reputation: 17
Muse continues

I applied your patch, but there's error at 84%:



[ 84%] Building CXX object muse/CMakeFiles/core.dir/dialogs.o
[ 84%] Building CXX object muse/CMakeFiles/core.dir/dssihost.o
[ 84%] Building CXX object muse/CMakeFiles/core.dir/lv2host.o
/tmp/SBo/muse-3.0pre2/muse/lv2host.cpp: In member function ‘virtual int MusECore::LV2SynthIF::getControllerInfo(int, QString*, int*, int*, int*, int*)’:
/tmp/SBo/muse-3.0pre2/muse/lv2host.cpp:3233:17: error: ‘DSSI_NONE’ was not declared in this scope
int ctlnum = DSSI_NONE;
^~~~~~~~~
/tmp/SBo/muse-3.0pre2/muse/lv2host.cpp:3233:17: note: suggested alternative: ‘SIGEV_NONE’
int ctlnum = DSSI_NONE;
^~~~~~~~~
SIGEV_NONE
/tmp/SBo/muse-3.0pre2/muse/lv2host.cpp: In member function ‘bool MusECore::LV2SynthIF:rocessEvent(const MusECore::MidiPlayEvent&, MusECore::LV2EvBuf*, long int)’:
/tmp/SBo/muse-3.0pre2/muse/lv2host.cpp:3505:20: error: ‘DSSI_NONE’ was not declared in this scope
int ctlnum = DSSI_NONE;
^~~~~~~~~
/tmp/SBo/muse-3.0pre2/muse/lv2host.cpp:3505:20: note: suggested alternative: ‘SIGEV_NONE’
int ctlnum = DSSI_NONE;
^~~~~~~~~
SIGEV_NONE
make[2]: *** [muse/CMakeFiles/core.dir/build.make:821: muse/CMakeFiles/core.dir/lv2host.o] Error 1
make[1]: *** [CMakeFiles/Makefile2:529: muse/CMakeFiles/core.dir/all] Error 2
make: *** [Makefile:152: all] Error 2
bash-4.4#
 
  


Reply

Tags
current, sbo, sbopkg, slackrepo


Thread Tools Search this Thread
Search this Thread:

Advanced Search

Posting Rules
You may not post new threads
You may not post replies
You may not post attachments
You may not edit your posts

BB code is On
Smilies are On
[IMG] code is Off
HTML code is Off



Similar Threads
Thread Thread Starter Forum Replies Last Post
[SOLVED] Error building gst1-plugins-good 1.4.1 from SBO l0rddarkf0rce Slackware 4 10-06-2014 05:58 PM
[SOLVED] Failure building nvidia-kernel Slackbuild from SBo sysfce2 Slackware 7 07-02-2011 01:10 AM
problems building fontforge from SBo gtludwig Slackware 7 05-12-2010 01:52 PM
Pls help me take my 1st step! verysoon Fedora - Installation 2 12-12-2005 07:49 AM


All times are GMT -5. The time now is 06:01 PM.

Main Menu
Advertisement
My LQ
Write for LQ
LinuxQuestions.org is looking for people interested in writing Editorials, Articles, Reviews, and more. If you'd like to contribute content, let us know.
Main Menu
Syndicate
RSS1  Latest Threads
RSS1  LQ News
Twitter: @linuxquestions
Facebook: linuxquestions Google+: linuxquestions
Open Source Consulting | Domain Registration