LinuxQuestions.org
View the Most Wanted LQ Wiki articles.
Go Back   LinuxQuestions.org > Forums > Linux Forums > Linux - Distributions > Slackware
User Name
Password
Slackware This Forum is for the discussion of Slackware Linux.

Notices

Reply
 
Search this Thread
Old 01-21-2013, 03:43 PM   #1
Bazzaah
Member
 
Registered: Mar 2007
Distribution: Slackware64-current, Slackware64 14
Posts: 327

Rep: Reputation: 49
Qt error when


Hi

I just compiled Amarok 2.7 and during installation I get this error after I run '# make install';

Code:
[ 59%] Building CXX object src/core-impl/collections/playdarcollection/CMakeFiles/amarok_collection-pla-playdarcollection_automoc.o
In file included from /usr/lib64/qt/include/QtCore/QObject:1:0,
                 from /home/slack/Downloads/amarok-2.7.0/amarok-2.7.0-build/src/core-impl/collections/pcore-impl/collections/playdarcollection/support/Controller.h:20,
                 from /home/slack/Downloads/amarok-2.7.0/amarok-2.7.0-build/src/core-impl/collections/pcore-impl/collections/playdarcollection/support/ProxyResolver.h:20,
                 from /home/slack/Downloads/amarok-2.7.0/amarok-2.7.0-build/src/core-impl/collections/ppp:10,
                 from /home/slack/Downloads/amarok-2.7.0/amarok-2.7.0-build/src/core-impl/collections/playdarcollection_automoc.cpp:4:
/usr/lib64/qt/include/QtCore/qobject.h:47:32: fatal error: QtCore/qobjectdefs.h: No such file or direct
compilation terminated.
make[2]: *** [src/core-impl/collections/playdarcollection/CMakeFiles/amarok_collection-playdarcollectioction_automoc.o] Error 1
make[1]: *** [src/core-impl/collections/playdarcollection/CMakeFiles/amarok_collection-playdarcollectio
make: *** [all] Error 2
Any ideas on how I might be able to remedy this? The objects appear to be there.

I'm using Slackware-current.

Thanks in advance for any help
 
Old 01-21-2013, 05:44 PM   #2
knudfl
LQ 5k Club
 
Registered: Jan 2008
Location: Copenhagen, DK
Distribution: pclos2014.08, Slack14.1 DebWheezy, +50+ other Linux OS, for test only.
Posts: 14,125

Rep: Reputation: 2639Reputation: 2639Reputation: 2639Reputation: 2639Reputation: 2639Reputation: 2639Reputation: 2639Reputation: 2639Reputation: 2639Reputation: 2639Reputation: 2639
A corrupt amarok-2.7.0.tar.bz2 ? ?

Or a corrupt file in qt ?

→ → Difficult to say : No issues here, a clean install of Slackware 14 - 64.
Code:
Linking CXX executable amarok_afttagger
[100%] Built target amarok_afttagger
 
Old 01-22-2013, 03:41 AM   #3
willysr
Senior Member
 
Registered: Jul 2004
Location: Jogja, Indonesia
Distribution: Slackware-Current
Posts: 2,594

Rep: Reputation: 435Reputation: 435Reputation: 435Reputation: 435Reputation: 435
i built Amarok and it built fine here, so probably it's a corrupt file
Code:
root@office:/home/willysr# head -10 /var/log/packages/amarok-2.7.0-i486-1 
PACKAGE NAME:     amarok-2.7.0-i486-1
COMPRESSED PACKAGE SIZE:     40M
UNCOMPRESSED PACKAGE SIZE:     74M
PACKAGE LOCATION: /tmp/kde-build/extragear/amarok-2.7.0-i486-1.txz
PACKAGE DESCRIPTION:
amarok: amarok (music player)
amarok:
amarok: Amarok is a music player for Linux and Unix with an intuitive
amarok: interface.  Amarok makes playing the music you love easier than ever
amarok: before -- and looks good doing it
 
Old 01-22-2013, 05:18 AM   #4
Bazzaah
Member
 
Registered: Mar 2007
Distribution: Slackware64-current, Slackware64 14
Posts: 327

Original Poster
Rep: Reputation: 49
The problem was running
Code:
sudo make install
instead of
Code:
make install
as su.

D'oh.

Thanks for the replies though.
 
  


Reply


Thread Tools Search this Thread
Search this Thread:

Advanced Search

Posting Rules
You may not post new threads
You may not post replies
You may not post attachments
You may not edit your posts

BB code is On
Smilies are On
[IMG] code is Off
HTML code is Off


Similar Threads
Thread Thread Starter Forum Replies Last Post
Error 502 : Display Fatal Error Message, Error pushing image, dbpaCT failed! HaloCheng Linux - Newbie 1 09-12-2012 01:02 PM
[SOLVED] Google-Chrome Error (Error 9 (net::ERR_UNEXPECTED): Unknown error) smoooth103 Slackware 4 12-04-2010 08:42 PM
[SOLVED] php5 ./configure error: (FILENAME=- FNR=27) fatal error: internal error richinsc Linux - Software 2 07-08-2010 10:20 AM
Memory error: extended error chipkill ecc error rajivdp Linux - Hardware 1 12-07-2009 09:26 AM
Sendmail: eocket wedge , 504 error , dsn error, mail relay connection error djcs Debian 0 03-03-2009 01:41 AM


All times are GMT -5. The time now is 03:16 PM.

Main Menu
My LQ
Write for LQ
LinuxQuestions.org is looking for people interested in writing Editorials, Articles, Reviews, and more. If you'd like to contribute content, let us know.
Main Menu
Syndicate
RSS1  Latest Threads
RSS1  LQ News
Twitter: @linuxquestions
identi.ca: @linuxquestions
Facebook: linuxquestions Google+: linuxquestions
Open Source Consulting | Domain Registration