LinuxQuestions.org
Latest LQ Deal: Latest LQ Deals
Go Back   LinuxQuestions.org > Forums > Linux Forums > Linux - Software
User Name
Password
Linux - Software This forum is for Software issues.
Having a problem installing a new program? Want to know which application is best for the job? Post your question in this forum.

Notices


Reply
  Search this Thread
Old 03-31-2006, 02:08 PM   #1
stryfetew
LQ Newbie
 
Registered: Aug 2004
Posts: 11

Rep: Reputation: 0
glibc compiling issues


bash: command substitution: line 1: unexpected EOF while looking for matching `''
bash: command substitution: line 3: syntax error: unexpected end of file
bash: ../sysdeps/unix/sysv/linux/i386/sigaction.c:91:: No such file or directory
[root@wdfgaming glibc-build]# collect2: ld returned 1 exit status
bash: collect2:: command not found
[root@wdfgaming glibc-build]# make[2]: *** [/home/n0-g00d/glibc-build/nptl/libpthread.so] Error 1
bash: make[2]:: command not found
[root@wdfgaming glibc-build]# make[2]: Leaving directory `/home/n0-g00d/glibc-2.4/intl'
> make[1]: *** [intl/tests] Error 2
> make[1]: Leaving directory `/home/n0-g00d/glibc-2.4'
> make: *** [check] Error 2
> ../sysdeps/unix/sysv/linux/i386/sigaction.c:91: undefined reference to `_rtld_global_ro'
bash: command substitution: line 1: unexpected EOF while looking for matching `''
bash: command substitution: line 4: syntax error: unexpected end of file
bash: make[2]:: command not found
[root@wdfgaming glibc-build]# /home/n0-g00d/glibc-build/nptl/libpthread_pic.a(herrno.os): In function `__h_errno_location':
bash: syntax error near unexpected token `herrno.os'
[root@wdfgaming glibc-build]# /home/n0-g00d/glibc-2.4/nptl/herrno.c:33: undefined reference to `___tls_get_addr'
> collect2: ld returned 1 exit status
> make[2]: *** [/home/n0-g00d/glibc-build/nptl/libpthread.so] Error 1
> make[2]: Leaving directory `/home/n0-g00d/glibc-2.4/intl'
> make[1]: *** [intl/tests] Error 2
> make[1]: Leaving directory `/home/n0-g00d/glibc-2.4'
bash: command substitution: line 1: unexpected EOF while looking for matching `''
bash: command substitution: line 5: syntax error: unexpected end of file
bash: /home/n0-g00d/glibc-2.4/nptl/herrno.c:33:: No such file or directory
[root@wdfgaming glibc-build]# make: *** [check] Error 2
bash: make:: command not found
[root@wdfgaming glibc-build]#





It does have gcc 4.0.3 installed.. So i'm not sure what else my problem lies with this.
 
Old 03-31-2006, 07:15 PM   #2
DeusExLinux
Member
 
Registered: May 2004
Location: Tampa, Fl
Distribution: Arch
Posts: 648

Rep: Reputation: 30
You sure you didn't inadvertantely upgrade to 4.1, that happened to me for about a week, I was wondering why nothing would compile...
 
Old 03-31-2006, 10:32 PM   #3
foo_bar_foo
Senior Member
 
Registered: Jun 2004
Posts: 2,553

Rep: Reputation: 53
what configure flags did you use to set this up ?
i think show entire configure command
basically just use --enable-add-ons
and not other stuff about threading to use NPTL
 
Old 03-31-2006, 10:40 PM   #4
stryfetew
LQ Newbie
 
Registered: Aug 2004
Posts: 11

Original Poster
Rep: Reputation: 0
I actually ended up getting it to compile when i did a make all and not make check..
 
Old 04-12-2006, 01:32 PM   #5
tomdkat
Member
 
Registered: May 2003
Location: S.F. Bay Area
Distribution: Ubuntu 9.04 AMD64
Posts: 595

Rep: Reputation: 30
Quote:
Originally Posted by stryfetew
It does have gcc 4.0.3 installed.. So i'm not sure what else my problem lies with this.
The gblic-2.4 INSTALL file specifically states gcc-3.4 or gcc-4.1 should be used to build it and gcc-4.1 is recommended. It also states if "make check" fails, the library built should not be used.

If you have a working system now, I would install gcc-3.4.6 or gcc-4.1.0 and re-build glibc-2.4 with the hope the test suite will run ok and then re-install glibc-2.4.

May the Force be with you.

Peace...

Last edited by tomdkat; 04-12-2006 at 01:33 PM.
 
  


Reply


Thread Tools Search this Thread
Search this Thread:

Advanced Search

Posting Rules
You may not post new threads
You may not post replies
You may not post attachments
You may not edit your posts

BB code is On
Smilies are On
[IMG] code is Off
HTML code is Off



Similar Threads
Thread Thread Starter Forum Replies Last Post
[SOLVED] compiling glibc-2.4 error aihaike Slackware 3 03-24-2006 05:04 AM
Compiling glibc-2.3.5 or glibc 2.3.5-r1 on Gentoo fails ghrellin Linux - Software 2 07-19-2005 02:01 AM
glibc 2.3.2 => glibc 2.3.3 causes bash & syslog issues natetheros Red Hat 1 09-27-2004 02:35 AM
Problem compiling glibc Azmeen Linux From Scratch 4 07-09-2003 11:48 AM
Compiling glibc Scerj Programming 1 06-27-2001 12:05 PM

LinuxQuestions.org > Forums > Linux Forums > Linux - Software

All times are GMT -5. The time now is 04:25 AM.

Main Menu
Advertisement
My LQ
Write for LQ
LinuxQuestions.org is looking for people interested in writing Editorials, Articles, Reviews, and more. If you'd like to contribute content, let us know.
Main Menu
Syndicate
RSS1  Latest Threads
RSS1  LQ News
Twitter: @linuxquestions
Open Source Consulting | Domain Registration