LinuxQuestions.org
Visit the LQ Articles and Editorials section
Go Back   LinuxQuestions.org > Forums > Linux Forums > Linux - Software
User Name
Password
Linux - Software This forum is for Software issues.
Having a problem installing a new program? Want to know which application is best for the job? Post your question in this forum.

Notices

Reply
 
Search this Thread
Old 05-11-2012, 02:28 AM   #1
Knightron
Senior Member
 
Registered: Jan 2011
Location: Planet Earth
Distribution: Slackware.
Posts: 1,339
Blog Entries: 7

Rep: Reputation: 159Reputation: 159
Compiling Gimp 2.8 problems


Hello, i've been running gimp 28rc on Opensuse 12.1 and was happy enough i decided to compile the full release. I've removed the previous version and am now trying to compile 2.8.
I am new to compiling but giving it a shot.
I keep getting the following error

Code:
*** Could not run GTK+ test program, checking why...
*** The test program failed to compile or link. See the file config.log for the
*** exact error that occurred. This usually means GTK+ is incorrectly installed.
configure: error: Test for GTK+ failed. See the file 'INSTALL' for help.
I have installed gtk 2.24.10 from the opensuse factory repo, but i'm still having issues. Here is the results of zypper search -is gtk

Code:
klaye@linux-2imn:~/data/build/gimp-2.8.0> zypper search -is gtk
Loading repository data...
Reading installed packages...

S | Name                          | Type    | Version      | Arch   | Repository                        
--+-------------------------------+---------+--------------+--------+-----------------------------------
i | PackageKit-gtk-module         | package | 0.6.19-2.6.1 | x86_64 | Updates for openSUSE 12.1 12.1-1.4
i | PackageKit-gtk3-module        | package | 0.6.19-2.6.1 | x86_64 | Updates for openSUSE 12.1 12.1-1.4
i | gtk2-branding-openSUSE        | package | 12.1-7.4     | noarch | factory                           
i | gtk2-data                     | package | 2.24.10-2.3  | noarch | factory                           
i | gtk2-devel                    | package | 2.24.10-2.3  | x86_64 | factory                           
i | gtk2-engine-clearlooks        | package | 2.20.2-10.5  | x86_64 | factory                           
i | gtk2-engine-crux              | package | 2.20.2-10.5  | x86_64 | factory                           
i | gtk2-engine-glide             | package | 2.20.2-10.5  | x86_64 | factory                           
i | gtk2-engine-hcengine          | package | 2.20.2-10.5  | x86_64 | factory                           
i | gtk2-engine-industrial        | package | 2.20.2-10.5  | x86_64 | factory                           
i | gtk2-engine-mist              | package | 2.20.2-10.5  | x86_64 | factory                           
i | gtk2-engine-redmond95         | package | 2.20.2-10.5  | x86_64 | factory                           
i | gtk2-engine-thinice           | package | 2.20.2-10.5  | x86_64 | factory                           
i | gtk2-engines                  | package | 2.20.2-10.5  | x86_64 | factory                           
i | gtk2-engines-32bit            | package | 2.20.2-7.1.2 | x86_64 | openSUSE-12.1-Oss                 
i | gtk2-immodule-amharic         | package | 2.24.10-2.3  | x86_64 | factory                           
i | gtk2-immodule-inuktitut       | package | 2.24.10-2.3  | x86_64 | factory                           
i | gtk2-immodule-thai            | package | 2.24.10-2.3  | x86_64 | factory                           
i | gtk2-immodule-vietnamese      | package | 2.24.10-2.3  | x86_64 | factory                           
i | gtk2-metatheme-adwaita        | package | 3.2.1-2.1.2  | noarch | openSUSE-12.1-Oss                 
i | gtk2-metatheme-adwaita        | package | 3.2.1-2.1.2  | noarch | openSUSE-12.1-12.1-1.4            
i | gtk2-metatheme-gilouche       | package | 11.1.2-17.1  | noarch | factory                           
i | gtk2-metatheme-industrial     | package | 0.6.5-63.1   | noarch | factory                           
i | gtk2-theme-clearlooks         | package | 2.20.2-10.5  | noarch | factory                           
i | gtk2-theme-crux               | package | 2.20.2-10.5  | noarch | factory                           
i | gtk2-theme-industrial         | package | 2.20.2-10.5  | noarch | factory                           
i | gtk2-theme-mist               | package | 2.20.2-10.5  | noarch | factory                           
i | gtk2-theme-redmond95          | package | 2.20.2-10.5  | noarch | factory                           
i | gtk2-theme-thinice            | package | 2.20.2-10.5  | noarch | factory                           
i | gtk2-tools                    | package | 2.24.10-2.3  | x86_64 | factory                           
i | gtk2-tools-32bit              | package | 2.24.10-2.3  | x86_64 | factory                           
i | gtk3-branding-openSUSE        | package | 12.1-5.1.1   | noarch | openSUSE-12.1-Oss                 
i | gtk3-branding-openSUSE        | package | 12.1-5.1.1   | noarch | openSUSE-12.1-12.1-1.4            
i | gtk3-data                     | package | 3.2.1-2.5.1  | noarch | Updates for openSUSE 12.1 12.1-1.4
i | gtk3-immodule-amharic         | package | 3.2.1-2.5.1  | x86_64 | Updates for openSUSE 12.1 12.1-1.4
i | gtk3-immodule-inuktitut       | package | 3.2.1-2.5.1  | x86_64 | Updates for openSUSE 12.1 12.1-1.4
i | gtk3-immodule-thai            | package | 3.2.1-2.5.1  | x86_64 | Updates for openSUSE 12.1 12.1-1.4
i | gtk3-immodule-vietnamese      | package | 3.2.1-2.5.1  | x86_64 | Updates for openSUSE 12.1 12.1-1.4
i | gtk3-metatheme-adwaita        | package | 3.2.1-2.1.2  | noarch | openSUSE-12.1-Oss                 
i | gtk3-metatheme-adwaita        | package | 3.2.1-2.1.2  | noarch | openSUSE-12.1-12.1-1.4            
i | gtk3-theming-engine-adwaita   | package | 3.2.1-2.1.2  | x86_64 | openSUSE-12.1-Oss                 
i | gtk3-theming-engine-adwaita   | package | 3.2.1-2.1.2  | x86_64 | openSUSE-12.1-12.1-1.4            
i | gtk3-tools                    | package | 3.2.1-2.5.1  | x86_64 | Updates for openSUSE 12.1 12.1-1.4
i | kcm_gtk                       | package | 1.1-17.2     | x86_64 | (System Packages)                 
i | libcanberra-gtk-module-common | package | 0.28-5.1.2   | x86_64 | openSUSE-12.1-Oss                 
i | libcanberra-gtk-module-common | package | 0.28-5.1.2   | x86_64 | openSUSE-12.1-12.1-1.4            
i | libcanberra-gtk0              | package | 0.28-5.1.2   | x86_64 | openSUSE-12.1-Oss                 
i | libcanberra-gtk0              | package | 0.28-5.1.2   | x86_64 | openSUSE-12.1-12.1-1.4            
i | libcanberra-gtk0-32bit        | package | 0.28-5.1.2   | x86_64 | openSUSE-12.1-Oss                 
i | libcanberra-gtk2-module       | package | 0.28-5.1.2   | x86_64 | openSUSE-12.1-Oss                 
i | libcanberra-gtk2-module       | package | 0.28-5.1.2   | x86_64 | openSUSE-12.1-12.1-1.4            
i | libcanberra-gtk2-module-32bit | package | 0.28-5.1.2   | x86_64 | openSUSE-12.1-Oss                 
i | libcanberra-gtk3-0            | package | 0.28-5.1.2   | x86_64 | openSUSE-12.1-Oss                 
i | libcanberra-gtk3-0            | package | 0.28-5.1.2   | x86_64 | openSUSE-12.1-12.1-1.4            
i | libcanberra-gtk3-module       | package | 0.28-5.1.2   | x86_64 | openSUSE-12.1-Oss                 
i | libcanberra-gtk3-module       | package | 0.28-5.1.2   | x86_64 | openSUSE-12.1-12.1-1.4            
i | libcheese-gtk20               | package | 3.2.1-2.1.2  | x86_64 | openSUSE-12.1-Oss                 
i | libcheese-gtk20               | package | 3.2.1-2.1.2  | x86_64 | openSUSE-12.1-12.1-1.4            
i | libclutter-gtk-1_0-0          | package | 1.0.4-2.1.2  | x86_64 | openSUSE-12.1-Oss                 
i | libclutter-gtk-1_0-0          | package | 1.0.4-2.1.2  | x86_64 | openSUSE-12.1-12.1-1.4            
i | libgtk-2_0-0                  | package | 2.24.10-2.3  | x86_64 | factory                           
i | libgtk-2_0-0-32bit            | package | 2.24.10-2.3  | x86_64 | factory                           
i | libgtk-3-0                    | package | 3.2.1-2.5.1  | x86_64 | Updates for openSUSE 12.1 12.1-1.4
i | libjavascriptcoregtk-1_0-0    | package | 1.6.1-2.1.2  | x86_64 | openSUSE-12.1-Oss                 
i | libjavascriptcoregtk-1_0-0    | package | 1.6.1-2.1.2  | x86_64 | openSUSE-12.1-12.1-1.4            
i | libjavascriptcoregtk-3_0-0    | package | 1.6.1-2.1.2  | x86_64 | openSUSE-12.1-Oss                 
i | libjavascriptcoregtk-3_0-0    | package | 1.6.1-2.1.2  | x86_64 | openSUSE-12.1-12.1-1.4            
i | libwebkitgtk-1_0-0            | package | 1.6.1-2.1.2  | x86_64 | openSUSE-12.1-Oss                 
i | libwebkitgtk-1_0-0            | package | 1.6.1-2.1.2  | x86_64 | openSUSE-12.1-12.1-1.4            
i | libwebkitgtk-3_0-0            | package | 1.6.1-2.1.2  | x86_64 | openSUSE-12.1-Oss                 
i | libwebkitgtk-3_0-0            | package | 1.6.1-2.1.2  | x86_64 | openSUSE-12.1-12.1-1.4            
i | libwx_gtk2u_adv-2_8-0-stl     | package | 2.8.12-6.1.2 | x86_64 | openSUSE-12.1-Oss                 
i | libwx_gtk2u_adv-2_8-0-stl     | package | 2.8.12-6.1.2 | x86_64 | openSUSE-12.1-12.1-1.4            
i | libwx_gtk2u_aui-2_8-0-stl     | package | 2.8.12-6.1.2 | x86_64 | openSUSE-12.1-Oss                 
i | libwx_gtk2u_aui-2_8-0-stl     | package | 2.8.12-6.1.2 | x86_64 | openSUSE-12.1-12.1-1.4            
i | libwx_gtk2u_core-2_8-0-stl    | package | 2.8.12-6.1.2 | x86_64 | openSUSE-12.1-Oss                 
i | libwx_gtk2u_core-2_8-0-stl    | package | 2.8.12-6.1.2 | x86_64 | openSUSE-12.1-12.1-1.4            
i | libwx_gtk2u_gl-2_8-0-stl      | package | 2.8.12-6.1.2 | x86_64 | openSUSE-12.1-Oss                 
i | libwx_gtk2u_gl-2_8-0-stl      | package | 2.8.12-6.1.2 | x86_64 | openSUSE-12.1-12.1-1.4            
i | libwx_gtk2u_html-2_8-0-stl    | package | 2.8.12-6.1.2 | x86_64 | openSUSE-12.1-Oss                 
i | libwx_gtk2u_html-2_8-0-stl    | package | 2.8.12-6.1.2 | x86_64 | openSUSE-12.1-12.1-1.4            
i | libwx_gtk2u_xrc-2_8-0-stl     | package | 2.8.12-6.1.2 | x86_64 | openSUSE-12.1-Oss                 
i | libwx_gtk2u_xrc-2_8-0-stl     | package | 2.8.12-6.1.2 | x86_64 | openSUSE-12.1-12.1-1.4            
i | oxygen-gtk                    | package | 1.1.4-2.4.1  | x86_64 | Updates for openSUSE 12.1 12.1-1.4
i | python-gtk                    | package | 2.24.0-6.4   | x86_64 | factory                           
i | typelib-1_0-Gtk-2_0           | package | 2.24.10-2.3  | x86_64 | factory
 
Old 05-11-2012, 02:29 AM   #2
Knightron
Senior Member
 
Registered: Jan 2011
Location: Planet Earth
Distribution: Slackware.
Posts: 1,339
Blog Entries: 7

Original Poster
Rep: Reputation: 159Reputation: 159
I can't work it out.. Here's the config.log file
Code:
This file contains any messages produced by compilers while
running configure, to aid debugging if configure makes a mistake.

It was created by GIMP configure 2.8.0, which was
generated by GNU Autoconf 2.68.  Invocation command line was

  $ ./configure 

## --------- ##
## Platform. ##
## --------- ##

hostname = linux-2imn.site
uname -m = x86_64
uname -r = 3.1.10-1.9-desktop
uname -s = Linux
uname -v = #1 SMP PREEMPT Thu Apr 5 18:48:38 UTC 2012 (4a97ec8)

/usr/bin/uname -p = unknown
/bin/uname -X     = unknown

/bin/arch              = x86_64
/usr/bin/arch -k       = unknown
/usr/convex/getsysinfo = unknown
/usr/bin/hostinfo      = unknown
/bin/machine           = unknown
/usr/bin/oslevel       = unknown
/bin/universe          = unknown

PATH: /usr/local/bin
PATH: /usr/bin
PATH: /bin
PATH: /usr/bin/X11
PATH: /usr/X11R6/bin
PATH: /usr/games
PATH: /usr/lib64/jvm/jre/bin


## ----------- ##
## Core tests. ##
## ----------- ##

configure:2711: loading site script /usr/share/site/x86_64-unknown-linux-gnu
| #!/bin/sh
| # Site script for configure. It is resourced via \$CONFIG_SITE environment varaible.
| 
| # If user did not specify libdir, guess the correct target:
| # Use lib64 for 64 bit targets, keep the default for the rest.
| if test "$libdir" = '${exec_prefix}/lib' ; then
| 
| 	# We are trying to guess 32-bit target compilation. It's not as easy as
| 	# it sounds, as there is possible several intermediate combinations.
| 	ac_config_site_32bit_target=NONE
| 
| 	# User defined -m32 in CFLAGS or CXXFLAGS:
| 	# (It's sufficient for 32-bit, but alone may cause mis-behavior of some checks.)
| 	case "$CFLAGS" in
| 		*-m32*)
| 			ac_config_site_32bit_target=YES
| 			;;
| 	esac
| 	case "$CXXFLAGS" in
| 		*-m32*)
| 			ac_config_site_32bit_target=YES
| 			;;
| 	esac
| 
| 	# User explicitly specified counterpart --host:
| 	# (If cross toolchain is installed, generates 32-bit, else generates native.)
| 	case "$host" in
| 			*i[3456]86-* | ppc-* | s390-* )
| 			ac_config_site_32bit_target=YES
| 			;;
| 	esac
| 
| 	# Running with linux32:
| 	# (Changes detected platform, but not the toolchain target.)
| 	case "`/bin/uname -i`" in
| 		x86_64 | ppc64 | s390x )
| 			;;
| 		* )
| 			ac_config_site_32bit_target=YES
| 			;;
| 	esac
| 
| 	if test "x$ac_config_site_32bit_target" = xNONE; then
| 		libdir='${exec_prefix}/lib64'
| 	fi
| fi
| 
| # If user did not specify libexecdir, guess the correct target:
| # Nor FHS nor openSUSE allow prefix/libexec. Let's default to prefix/lib.
| 
| libexecdir='${exec_prefix}/lib'
| 
| # Continue with the standard behavior of configure defined in AC_SITE_LOAD:
| if test "x$prefix" != xNONE; then
| 	ac_site_file1=$prefix/share/config.site
| 	ac_site_file2=$prefix/etc/config.site
| else
| 	ac_site_file1=$ac_default_prefix/share/config.site
| 	ac_site_file2=$ac_default_prefix/etc/config.site
| fi
| for ac_site_file in "$ac_site_file1" "$ac_site_file2"
| do
| 	test "x$ac_site_file" = xNONE && continue
| 	if test /dev/null != "$ac_site_file" && test -r "$ac_site_file"; then
| 		{ $as_echo "/usr/share/site/x86_64-unknown-linux-gnu:${as_lineno-$LINENO}: loading site script $ac_site_file" >&5
| $as_echo "/usr/share/site/x86_64-unknown-linux-gnu: loading site script $ac_site_file" >&6;}
| 		sed 's/^/| /' "$ac_site_file" >&5
| 		. "$ac_site_file" \
| 			|| { { $as_echo "/usr/share/site/x86_64-unknown-linux-gnu:${as_lineno-$LINENO}: error: in \`$ac_pwd':" >&5
| $as_echo "/usr/share/site/x86_64-unknown-linux-gnu: error: in \`$ac_pwd':" >&2;}
| as_fn_error $? "failed to load site script $ac_site_file
| See \`config.log' for more details" "$LINENO" 5; }
| 	fi
| done
configure:2858: checking for a BSD-compatible install
configure:2926: result: /usr/bin/install -c
configure:2937: checking whether build environment is sane
configure:2987: result: yes
configure:3128: checking for a thread-safe mkdir -p
configure:3167: result: /bin/mkdir -p
configure:3180: checking for gawk
configure:3196: found /usr/bin/gawk
configure:3207: result: gawk
configure:3218: checking whether make sets $(MAKE)
configure:3240: result: yes
configure:3326: checking whether make supports nested variables
configure:3343: result: yes
configure:3487: checking for gcc
configure:3503: found /usr/bin/gcc
configure:3514: result: gcc
configure:3743: checking for C compiler version
configure:3752: gcc --version >&5
gcc (SUSE Linux) 4.6.2
Copyright (C) 2011 Free Software Foundation, Inc.
This is free software; see the source for copying conditions.  There is NO
warranty; not even for MERCHANTABILITY or FITNESS FOR A PARTICULAR PURPOSE.

configure:3763: $? = 0
configure:3752: gcc -v >&5
Using built-in specs.
COLLECT_GCC=gcc
COLLECT_LTO_WRAPPER=/usr/lib64/gcc/x86_64-suse-linux/4.6/lto-wrapper
Target: x86_64-suse-linux
Configured with: ../configure --prefix=/usr --infodir=/usr/share/info --mandir=/usr/share/man --libdir=/usr/lib64 --libexecdir=/usr/lib64 --enable-languages=c,c++,objc,fortran,obj-c++,java,ada --enable-checking=release --with-gxx-include-dir=/usr/include/c++/4.6 --enable-ssp --disable-libssp --disable-plugin --with-bugurl=http://bugs.opensuse.org/ --with-pkgversion='SUSE Linux' --disable-libgcj --disable-libmudflap --with-slibdir=/lib64 --with-system-zlib --enable-__cxa_atexit --enable-libstdcxx-allocator=new --disable-libstdcxx-pch --enable-version-specific-runtime-libs --program-suffix=-4.6 --enable-linux-futex --without-system-libunwind --with-arch-32=i586 --with-tune=generic --build=x86_64-suse-linux
Thread model: posix
gcc version 4.6.2 (SUSE Linux) 
configure:3763: $? = 0
configure:3752: gcc -V >&5
gcc: error: unrecognized option '-V'
gcc: fatal error: no input files
compilation terminated.
configure:3763: $? = 1
configure:3752: gcc -qversion >&5
gcc: error: unrecognized option '-qversion'
gcc: fatal error: no input files
compilation terminated.
configure:3763: $? = 1
configure:3783: checking whether the C compiler works
configure:3805: gcc    conftest.c  >&5
configure:3809: $? = 0
configure:3857: result: yes
configure:3860: checking for C compiler default output file name
configure:3862: result: a.out
configure:3868: checking for suffix of executables
configure:3875: gcc -o conftest    conftest.c  >&5
configure:3879: $? = 0
configure:3901: result: 
configure:3923: checking whether we are cross compiling
configure:3931: gcc -o conftest    conftest.c  >&5
configure:3935: $? = 0
configure:3942: ./conftest
configure:3946: $? = 0
configure:3961: result: no
configure:3966: checking for suffix of object files
configure:3988: gcc -c   conftest.c >&5
configure:3992: $? = 0
configure:4013: result: o
configure:4017: checking whether we are using the GNU C compiler
configure:4036: gcc -c   conftest.c >&5
configure:4036: $? = 0
configure:4045: result: yes
configure:4054: checking whether gcc accepts -g
configure:4074: gcc -c -g  conftest.c >&5
configure:4074: $? = 0
configure:4115: result: yes
configure:4132: checking for gcc option to accept ISO C89
configure:4196: gcc  -c -g -O2  conftest.c >&5
configure:4196: $? = 0
configure:4209: result: none needed
configure:4240: checking for style of include used by make
configure:4268: result: GNU
configure:4294: checking dependency style of gcc
configure:4405: result: gcc3
configure:4421: checking whether gcc and cc understand -c and -o together
configure:4452: gcc -c conftest.c -o conftest2.o >&5
configure:4456: $? = 0
configure:4462: gcc -c conftest.c -o conftest2.o >&5
configure:4466: $? = 0
configure:4477: cc -c conftest.c >&5
configure:4481: $? = 0
configure:4489: cc -c conftest.c -o conftest2.o >&5
configure:4493: $? = 0
configure:4499: cc -c conftest.c -o conftest2.o >&5
configure:4503: $? = 0
configure:4521: result: yes
configure:4578: checking build system type
configure:4592: result: x86_64-unknown-linux-gnu
configure:4612: checking host system type
configure:4625: result: x86_64-unknown-linux-gnu
configure:4666: checking how to print strings
configure:4693: result: printf
configure:4714: checking for a sed that does not truncate output
configure:4778: result: /usr/bin/sed
configure:4796: checking for grep that handles long lines and -e
configure:4854: result: /usr/bin/grep
configure:4859: checking for egrep
configure:4921: result: /usr/bin/grep -E
configure:4926: checking for fgrep
configure:4988: result: /usr/bin/grep -F
configure:5023: checking for ld used by gcc
configure:5090: result: /usr/x86_64-suse-linux/bin/ld
configure:5097: checking if the linker (/usr/x86_64-suse-linux/bin/ld) is GNU ld
configure:5112: result: yes
configure:5124: checking for BSD- or MS-compatible name lister (nm)
configure:5173: result: /usr/bin/nm -B
configure:5303: checking the name lister (/usr/bin/nm -B) interface
configure:5310: gcc -c -g -O2  conftest.c >&5
configure:5313: /usr/bin/nm -B "conftest.o"
configure:5316: output
0000000000000000 B some_variable
configure:5323: result: BSD nm
configure:5326: checking whether ln -s works
configure:5330: result: yes
configure:5338: checking the maximum length of command line arguments
configure:5468: result: 1572864
configure:5485: checking whether the shell understands some XSI constructs
configure:5495: result: yes
configure:5499: checking whether the shell understands "+="
configure:5505: result: yes
configure:5540: checking how to convert x86_64-unknown-linux-gnu file names to x86_64-unknown-linux-gnu format
configure:5580: result: func_convert_file_noop
configure:5587: checking how to convert x86_64-unknown-linux-gnu file names to toolchain format
configure:5607: result: func_convert_file_noop
configure:5614: checking for /usr/x86_64-suse-linux/bin/ld option to reload object files
configure:5621: result: -r
configure:5695: checking for objdump
configure:5711: found /usr/bin/objdump
configure:5722: result: objdump
configure:5751: checking how to recognize dependent libraries
configure:5953: result: pass_all
configure:6038: checking for dlltool
configure:6068: result: no
configure:6095: checking how to associate runtime and link libraries
configure:6122: result: printf %s\n
configure:6183: checking for ar
configure:6199: found /usr/bin/ar
configure:6210: result: ar
configure:6247: checking for archiver @FILE support
configure:6264: gcc -c -g -O2  conftest.c >&5
configure:6264: $? = 0
configure:6267: ar cru libconftest.a @conftest.lst >&5
configure:6270: $? = 0
configure:6275: ar cru libconftest.a @conftest.lst >&5
ar: conftest.o: No such file or directory
configure:6278: $? = 1
configure:6290: result: @
configure:6348: checking for strip
configure:6364: found /usr/bin/strip
configure:6375: result: strip
configure:6447: checking for ranlib
configure:6463: found /usr/bin/ranlib
configure:6474: result: ranlib
configure:6576: checking command to parse /usr/bin/nm -B output from gcc object
configure:6696: gcc -c -g -O2  conftest.c >&5
configure:6699: $? = 0
configure:6703: /usr/bin/nm -B conftest.o \| sed -n -e 's/^.*[ ]\([ABCDGIRSTW][ABCDGIRSTW]*\)[ ][ ]*\([_A-Za-z][_A-Za-z0-9]*\)$/\1 \2 \2/p' | sed '/ __gnu_lto/d' \> conftest.nm
configure:6706: $? = 0
configure:6772: gcc -o conftest -g -O2   conftest.c conftstm.o >&5
configure:6775: $? = 0
configure:6813: result: ok
configure:6850: checking for sysroot
configure:6880: result: no
configure:6957: gcc -c -g -O2  conftest.c >&5
configure:6960: $? = 0
configure:7136: checking for mt
configure:7152: found /usr/bin/mt
configure:7163: result: mt
configure:7186: checking if mt is a manifest tool
configure:7192: mt '-?'
configure:7200: result: no
configure:7842: checking how to run the C preprocessor
configure:7873: gcc -E  conftest.c
configure:7873: $? = 0
configure:7887: gcc -E  conftest.c
conftest.c:10:28: fatal error: ac_nonexistent.h: No such file or directory
compilation terminated.
configure:7887: $? = 1
configure: failed program was:
| /* confdefs.h */
| #define PACKAGE_NAME "GIMP"
| #define PACKAGE_TARNAME "gimp"
| #define PACKAGE_VERSION "2.8.0"
| #define PACKAGE_STRING "GIMP 2.8.0"
| #define PACKAGE_BUGREPORT "http://bugzilla.gnome.org/enter_bug.cgi?product=GIMP"
| #define PACKAGE_URL ""
| #define GETTEXT_PACKAGE "gimp20"
| /* end confdefs.h.  */
| #include <ac_nonexistent.h>
configure:7912: result: gcc -E
configure:7932: gcc -E  conftest.c
configure:7932: $? = 0
configure:7946: gcc -E  conftest.c
conftest.c:10:28: fatal error: ac_nonexistent.h: No such file or directory
compilation terminated.
configure:7946: $? = 1
configure: failed program was:
| /* confdefs.h */
| #define PACKAGE_NAME "GIMP"
| #define PACKAGE_TARNAME "gimp"
| #define PACKAGE_VERSION "2.8.0"
| #define PACKAGE_STRING "GIMP 2.8.0"
| #define PACKAGE_BUGREPORT "http://bugzilla.gnome.org/enter_bug.cgi?product=GIMP"
| #define PACKAGE_URL ""
| #define GETTEXT_PACKAGE "gimp20"
| /* end confdefs.h.  */
| #include <ac_nonexistent.h>
configure:7975: checking for ANSI C header files
configure:7995: gcc -c -g -O2  conftest.c >&5
configure:7995: $? = 0
configure:8068: gcc -o conftest -g -O2   conftest.c  >&5
configure:8068: $? = 0
configure:8068: ./conftest
configure:8068: $? = 0
configure:8079: result: yes
configure:8092: checking for sys/types.h
configure:8092: gcc -c -g -O2  conftest.c >&5
configure:8092: $? = 0
configure:8092: result: yes
configure:8092: checking for sys/stat.h
configure:8092: gcc -c -g -O2  conftest.c >&5
configure:8092: $? = 0
configure:8092: result: yes
configure:8092: checking for stdlib.h
configure:8092: gcc -c -g -O2  conftest.c >&5
configure:8092: $? = 0
configure:8092: result: yes
configure:8092: checking for string.h
configure:8092: gcc -c -g -O2  conftest.c >&5
configure:8092: $? = 0
configure:8092: result: yes
configure:8092: checking for memory.h
configure:8092: gcc -c -g -O2  conftest.c >&5
configure:8092: $? = 0
configure:8092: result: yes
configure:8092: checking for strings.h
configure:8092: gcc -c -g -O2  conftest.c >&5
configure:8092: $? = 0
configure:8092: result: yes
configure:8092: checking for inttypes.h
configure:8092: gcc -c -g -O2  conftest.c >&5
configure:8092: $? = 0
configure:8092: result: yes
configure:8092: checking for stdint.h
configure:8092: gcc -c -g -O2  conftest.c >&5
configure:8092: $? = 0
configure:8092: result: yes
configure:8092: checking for unistd.h
configure:8092: gcc -c -g -O2  conftest.c >&5
configure:8092: $? = 0
configure:8092: result: yes
configure:8106: checking for dlfcn.h
configure:8106: gcc -c -g -O2  conftest.c >&5
configure:8106: $? = 0
configure:8106: result: yes
configure:8609: checking for objdir
configure:8624: result: .libs
configure:8891: checking if gcc supports -fno-rtti -fno-exceptions
configure:8909: gcc -c -g -O2  -fno-rtti -fno-exceptions conftest.c >&5
cc1: warning: command line option '-fno-rtti' is valid for C++/ObjC++ but not for C [enabled by default]
configure:8913: $? = 0
configure:8926: result: no
configure:9253: checking for gcc option to produce PIC
configure:9260: result: -fPIC -DPIC
configure:9268: checking if gcc PIC flag -fPIC -DPIC works
configure:9286: gcc -c -g -O2  -fPIC -DPIC -DPIC conftest.c >&5
configure:9290: $? = 0
configure:9303: result: yes
configure:9332: checking if gcc static flag -static works
configure:9360: result: no
configure:9375: checking if gcc supports -c -o file.o
configure:9396: gcc -c -g -O2  -o out/conftest2.o conftest.c >&5
configure:9400: $? = 0
configure:9422: result: yes
configure:9430: checking if gcc supports -c -o file.o
configure:9477: result: yes
configure:9510: checking whether the gcc linker (/usr/x86_64-suse-linux/bin/ld -m elf_x86_64) supports shared libraries
configure:10667: result: yes
configure:10704: checking whether -lc should be explicitly linked in
configure:10712: gcc -c -g -O2  conftest.c >&5
configure:10715: $? = 0
configure:10730: gcc -shared  -fPIC -DPIC conftest.o  -v -Wl,-soname -Wl,conftest -o conftest 2\>\&1 \| /usr/bin/grep  -lc  \>/dev/null 2\>\&1
configure:10733: $? = 0
configure:10747: result: no
configure:10907: checking dynamic linker characteristics
configure:11418: gcc -o conftest -g -O2   -Wl,-rpath -Wl,/foo conftest.c  >&5
configure:11418: $? = 0
configure:11652: result: GNU/Linux ld.so
configure:11759: checking how to hardcode library paths into programs
configure:11784: result: immediate
configure:12324: checking whether stripping libraries is possible
configure:12329: result: yes
configure:12364: checking if libtool supports shared libraries
configure:12366: result: yes
configure:12369: checking whether to build shared libraries
configure:12390: result: yes
configure:12393: checking whether to build static libraries
configure:12397: result: no
configure:12444: checking dependency style of gcc
configure:12553: result: gcc3
configure:12571: checking whether to enable maintainer-specific portions of Makefiles
configure:12580: result: yes
configure:12649: checking for pkg-config
configure:12667: found /usr/bin/pkg-config
configure:12679: result: /usr/bin/pkg-config
configure:12704: checking pkg-config is at least version 0.16
configure:12707: result: yes
configure:12721: checking for target architecture
configure:12729: result: x86_64-unknown-linux-gnu
configure:12772: checking for some Win32 platform
configure:12782: result: no
configure:12793: checking for native Win32
configure:12812: result: no
configure:12994: checking whether make sets $(MAKE)
configure:13016: result: yes
configure:13034: checking for special C compiler options needed for large files
configure:13079: result: no
configure:13085: checking for _FILE_OFFSET_BITS value needed for large files
configure:13110: gcc -c -g -O2  conftest.c >&5
configure:13110: $? = 0
configure:13142: result: no
configure:13226: checking whether to turn on debugging
configure:13241: result: no
configure:13245: checking whether to turn on profiling
configure:13260: result: no
configure:13299: checking whether gcc understands -Wdeclaration-after-statement
configure:13312: gcc -c -g -O2 -Wall -Wdeclaration-after-statement  conftest.c >&5
configure:13312: $? = 0
configure:13318: result: yes
configure:13335: checking whether gcc understands -Wmissing-prototypes
configure:13348: gcc -c -g -O2 -Wall -Wdeclaration-after-statement -Wmissing-prototypes  conftest.c >&5
configure:13348: $? = 0
configure:13354: result: yes
configure:13374: checking whether gcc understands -Werror=missing-prototypes
configure:13387: gcc -c -g -O2 -Wall -Wdeclaration-after-statement -Wmissing-prototypes -Werror=missing-prototypes  conftest.c >&5
configure:13387: $? = 0
configure:13393: result: yes
configure:13410: checking whether gcc understands -Wstrict-prototypes
configure:13423: gcc -c -g -O2 -Wall -Wdeclaration-after-statement -Wmissing-prototypes -Werror=missing-prototypes -Wstrict-prototypes  conftest.c >&5
conftest.c:26:1: warning: function declaration isn't a prototype [-Wstrict-prototypes]
configure:13423: $? = 0
configure:13429: result: yes
configure:13446: checking whether gcc understands -Wmissing-declarations
configure:13459: gcc -c -g -O2 -Wall -Wdeclaration-after-statement -Wmissing-prototypes -Werror=missing-prototypes -Wstrict-prototypes -Wmissing-declarations  conftest.c >&5
conftest.c:26:1: warning: function declaration isn't a prototype [-Wstrict-prototypes]
configure:13459: $? = 0
configure:13465: result: yes
configure:13482: checking whether gcc understands -Winit-self
configure:13495: gcc -c -g -O2 -Wall -Wdeclaration-after-statement -Wmissing-prototypes -Werror=missing-prototypes -Wstrict-prototypes -Wmissing-declarations -Winit-self  conftest.c >&5
conftest.c:26:1: warning: function declaration isn't a prototype [-Wstrict-prototypes]
configure:13495: $? = 0
configure:13501: result: yes
configure:13518: checking whether gcc understands -Wpointer-arith
configure:13531: gcc -c -g -O2 -Wall -Wdeclaration-after-statement -Wmissing-prototypes -Werror=missing-prototypes -Wstrict-prototypes -Wmissing-declarations -Winit-self -Wpointer-arith  conftest.c >&5
conftest.c:26:1: warning: function declaration isn't a prototype [-Wstrict-prototypes]
configure:13531: $? = 0
configure:13537: result: yes
configure:13554: checking whether gcc understands -Wold-style-definition
configure:13567: gcc -c -g -O2 -Wall -Wdeclaration-after-statement -Wmissing-prototypes -Werror=missing-prototypes -Wstrict-prototypes -Wmissing-declarations -Winit-self -Wpointer-arith -Wold-style-definition  conftest.c >&5
conftest.c:26:1: warning: function declaration isn't a prototype [-Wstrict-prototypes]
conftest.c: In function 'main':
conftest.c:26:1: warning: old-style function definition [-Wold-style-definition]
configure:13567: $? = 0
configure:13573: result: yes
configure:13590: checking whether gcc understands -Wmissing-format-attribute
configure:13603: gcc -c -g -O2 -Wall -Wdeclaration-after-statement -Wmissing-prototypes -Werror=missing-prototypes -Wstrict-prototypes -Wmissing-declarations -Winit-self -Wpointer-arith -Wold-style-definition -Wmissing-format-attribute  conftest.c >&5
conftest.c:26:1: warning: function declaration isn't a prototype [-Wstrict-prototypes]
conftest.c: In function 'main':
conftest.c:26:1: warning: old-style function definition [-Wold-style-definition]
configure:13603: $? = 0
configure:13609: result: yes
configure:13626: checking whether gcc understands -Wformat-security
configure:13639: gcc -c -g -O2 -Wall -Wdeclaration-after-statement -Wmissing-prototypes -Werror=missing-prototypes -Wstrict-prototypes -Wmissing-declarations -Winit-self -Wpointer-arith -Wold-style-definition -Wmissing-format-attribute -Wformat-security  conftest.c >&5
conftest.c:26:1: warning: function declaration isn't a prototype [-Wstrict-prototypes]
conftest.c: In function 'main':
conftest.c:26:1: warning: old-style function definition [-Wold-style-definition]
configure:13639: $? = 0
configure:13645: result: yes
configure:13662: checking whether gcc understands -Wformat-non-literal
configure:13675: gcc -c -g -O2 -Wall -Wdeclaration-after-statement -Wmissing-prototypes -Werror=missing-prototypes -Wstrict-prototypes -Wmissing-declarations -Winit-self -Wpointer-arith -Wold-style-definition -Wmissing-format-attribute -Wformat-security -Wformat-non-literal  conftest.c >&5
cc1: error: unrecognized command line option '-Wformat-non-literal'
configure:13675: $? = 1
configure: failed program was:
| /* confdefs.h */
| #define PACKAGE_NAME "GIMP"
| #define PACKAGE_TARNAME "gimp"
| #define PACKAGE_VERSION "2.8.0"
| #define PACKAGE_STRING "GIMP 2.8.0"
| #define PACKAGE_BUGREPORT "http://bugzilla.gnome.org/enter_bug.cgi?product=GIMP"
| #define PACKAGE_URL ""
| #define GETTEXT_PACKAGE "gimp20"
| #define STDC_HEADERS 1
| #define HAVE_SYS_TYPES_H 1
| #define HAVE_SYS_STAT_H 1
| #define HAVE_STDLIB_H 1
| #define HAVE_STRING_H 1
| #define HAVE_MEMORY_H 1
| #define HAVE_STRINGS_H 1
| #define HAVE_INTTYPES_H 1
| #define HAVE_STDINT_H 1
| #define HAVE_UNISTD_H 1
| #define HAVE_DLFCN_H 1
| #define LT_OBJDIR ".libs/"
| #define ARCH_X86 1
| #define ARCH_X86_64 1
| /* end confdefs.h.  */
| 
| int
| main ()
| {
| 
|   ;
|   return 0;
| }
configure:13681: result: no
configure:13698: checking whether gcc understands -fno-common
configure:13711: gcc -c -g -O2 -Wall -Wdeclaration-after-statement -Wmissing-prototypes -Werror=missing-prototypes -Wstrict-prototypes -Wmissing-declarations -Winit-self -Wpointer-arith -Wold-style-definition -Wmissing-format-attribute -Wformat-security  -fno-common  conftest.c >&5
conftest.c:26:1: warning: function declaration isn't a prototype [-Wstrict-prototypes]
conftest.c: In function 'main':
conftest.c:26:1: warning: old-style function definition [-Wold-style-definition]
configure:13711: $? = 0
configure:13717: result: yes
configure:13734: checking whether gcc understands -fdiagnostics-show-option
configure:13747: gcc -c -g -O2 -Wall -Wdeclaration-after-statement -Wmissing-prototypes -Werror=missing-prototypes -Wstrict-prototypes -Wmissing-declarations -Winit-self -Wpointer-arith -Wold-style-definition -Wmissing-format-attribute -Wformat-security  -fno-common -fdiagnostics-show-option  conftest.c >&5
conftest.c:26:1: warning: function declaration isn't a prototype [-Wstrict-prototypes]
conftest.c: In function 'main':
conftest.c:26:1: warning: old-style function definition [-Wold-style-definition]
configure:13747: $? = 0
configure:13753: result: yes
configure:13772: checking whether gcc understands --omg-optimized
configure:13785: gcc -c -g -O2 -Wall -Wdeclaration-after-statement -Wmissing-prototypes -Werror=missing-prototypes -Wstrict-prototypes -Wmissing-declarations -Winit-self -Wpointer-arith -Wold-style-definition -Wmissing-format-attribute -Wformat-security  -fno-common -fdiagnostics-show-option --omg-optimized  conftest.c >&5
gcc: error: unrecognized option '--omg-optimized'
configure:13785: $? = 1
configure: failed program was:
| /* confdefs.h */
| #define PACKAGE_NAME "GIMP"
| #define PACKAGE_TARNAME "gimp"
| #define PACKAGE_VERSION "2.8.0"
| #define PACKAGE_STRING "GIMP 2.8.0"
| #define PACKAGE_BUGREPORT "http://bugzilla.gnome.org/enter_bug.cgi?product=GIMP"
| #define PACKAGE_URL ""
| #define GETTEXT_PACKAGE "gimp20"
| #define STDC_HEADERS 1
| #define HAVE_SYS_TYPES_H 1
| #define HAVE_SYS_STAT_H 1
| #define HAVE_STDLIB_H 1
| #define HAVE_STRING_H 1
| #define HAVE_MEMORY_H 1
| #define HAVE_STRINGS_H 1
| #define HAVE_INTTYPES_H 1
| #define HAVE_STDINT_H 1
| #define HAVE_UNISTD_H 1
| #define HAVE_DLFCN_H 1
| #define LT_OBJDIR ".libs/"
| #define ARCH_X86 1
| #define ARCH_X86_64 1
| /* end confdefs.h.  */
| 
| int
| main ()
| {
| 
|   ;
|   return 0;
| }
configure:13791: result: no
configure:13808: checking whether gcc understands --disable-instructions
configure:13821: gcc -c -g -O2 -Wall -Wdeclaration-after-statement -Wmissing-prototypes -Werror=missing-prototypes -Wstrict-prototypes -Wmissing-declarations -Winit-self -Wpointer-arith -Wold-style-definition -Wmissing-format-attribute -Wformat-security  -fno-common -fdiagnostics-show-option  --disable-instructions  conftest.c >&5
gcc: error: unrecognized option '--disable-instructions'
configure:13821: $? = 1
configure: failed program was:
| /* confdefs.h */
| #define PACKAGE_NAME "GIMP"
| #define PACKAGE_TARNAME "gimp"
| #define PACKAGE_VERSION "2.8.0"
| #define PACKAGE_STRING "GIMP 2.8.0"
| #define PACKAGE_BUGREPORT "http://bugzilla.gnome.org/enter_bug.cgi?product=GIMP"
| #define PACKAGE_URL ""
| #define GETTEXT_PACKAGE "gimp20"
| #define STDC_HEADERS 1
| #define HAVE_SYS_TYPES_H 1
| #define HAVE_SYS_STAT_H 1
| #define HAVE_STDLIB_H 1
| #define HAVE_STRING_H 1
| #define HAVE_MEMORY_H 1
| #define HAVE_STRINGS_H 1
| #define HAVE_INTTYPES_H 1
| #define HAVE_STDINT_H 1
| #define HAVE_UNISTD_H 1
| #define HAVE_DLFCN_H 1
| #define LT_OBJDIR ".libs/"
| #define ARCH_X86 1
| #define ARCH_X86_64 1
| /* end confdefs.h.  */
| 
| int
| main ()
| {
| 
|   ;
|   return 0;
| }
configure:13827: result: no
configure:13879: checking for ANSI C header files
configure:13983: result: yes
configure:13991: checking for sys/wait.h that is POSIX.1 compatible
configure:14017: gcc -c -g -O2 -Wall -Wdeclaration-after-statement -Wmissing-prototypes -Werror=missing-prototypes -Wstrict-prototypes -Wmissing-declarations -Winit-self -Wpointer-arith -Wold-style-definition -Wmissing-format-attribute -Wformat-security  -fno-common -fdiagnostics-show-option    conftest.c >&5
conftest.c:35:1: warning: function declaration isn't a prototype [-Wstrict-prototypes]
conftest.c: In function 'main':
conftest.c:35:1: warning: old-style function definition [-Wold-style-definition]
configure:14017: $? = 0
configure:14024: result: yes
configure:14032: checking whether time.h and sys/time.h may both be included
configure:14052: gcc -c -g -O2 -Wall -Wdeclaration-after-statement -Wmissing-prototypes -Werror=missing-prototypes -Wstrict-prototypes -Wmissing-declarations -Winit-self -Wpointer-arith -Wold-style-definition -Wmissing-format-attribute -Wformat-security  -fno-common -fdiagnostics-show-option    conftest.c >&5
conftest.c:31:1: warning: function declaration isn't a prototype [-Wstrict-prototypes]
conftest.c: In function 'main':
conftest.c:31:1: warning: old-style function definition [-Wold-style-definition]
configure:14052: $? = 0
configure:14059: result: yes
configure:14071: checking sys/param.h usability
TO BE CONTINUED
 
Old 05-11-2012, 02:33 AM   #3
Knightron
Senior Member
 
Registered: Jan 2011
Location: Planet Earth
Distribution: Slackware.
Posts: 1,339
Blog Entries: 7

Original Poster
Rep: Reputation: 159Reputation: 159
Continuing
Code:
configure:14071: gcc -c -g -O2 -Wall -Wdeclaration-after-statement -Wmissing-prototypes -Werror=missing-prototypes -Wstrict-prototypes -Wmissing-declarations -Winit-self -Wpointer-arith -Wold-style-definition -Wmissing-format-attribute -Wformat-security  -fno-common -fdiagnostics-show-option    conftest.c >&5
configure:14071: $? = 0
configure:14071: result: yes
configure:14071: checking sys/param.h presence
configure:14071: gcc -E  conftest.c
configure:14071: $? = 0
configure:14071: result: yes
configure:14071: checking for sys/param.h
configure:14071: result: yes
configure:14071: checking sys/time.h usability
configure:14071: gcc -c -g -O2 -Wall -Wdeclaration-after-statement -Wmissing-prototypes -Werror=missing-prototypes -Wstrict-prototypes -Wmissing-declarations -Winit-self -Wpointer-arith -Wold-style-definition -Wmissing-format-attribute -Wformat-security  -fno-common -fdiagnostics-show-option    conftest.c >&5
configure:14071: $? = 0
configure:14071: result: yes
configure:14071: checking sys/time.h presence
configure:14071: gcc -E  conftest.c
configure:14071: $? = 0
configure:14071: result: yes
configure:14071: checking for sys/time.h
configure:14071: result: yes
configure:14071: checking sys/times.h usability
configure:14071: gcc -c -g -O2 -Wall -Wdeclaration-after-statement -Wmissing-prototypes -Werror=missing-prototypes -Wstrict-prototypes -Wmissing-declarations -Winit-self -Wpointer-arith -Wold-style-definition -Wmissing-format-attribute -Wformat-security  -fno-common -fdiagnostics-show-option    conftest.c >&5
configure:14071: $? = 0
configure:14071: result: yes
configure:14071: checking sys/times.h presence
configure:14071: gcc -E  conftest.c
configure:14071: $? = 0
configure:14071: result: yes
configure:14071: checking for sys/times.h
configure:14071: result: yes
configure:14071: checking for sys/wait.h
configure:14071: result: yes
configure:14071: checking for unistd.h
configure:14071: result: yes
configure:14082: checking for pid_t
configure:14082: gcc -c -g -O2 -Wall -Wdeclaration-after-statement -Wmissing-prototypes -Werror=missing-prototypes -Wstrict-prototypes -Wmissing-declarations -Winit-self -Wpointer-arith -Wold-style-definition -Wmissing-format-attribute -Wformat-security  -fno-common -fdiagnostics-show-option    conftest.c >&5
conftest.c:66:1: warning: function declaration isn't a prototype [-Wstrict-prototypes]
conftest.c: In function 'main':
conftest.c:66:1: warning: old-style function definition [-Wold-style-definition]
configure:14082: $? = 0
configure:14082: gcc -c -g -O2 -Wall -Wdeclaration-after-statement -Wmissing-prototypes -Werror=missing-prototypes -Wstrict-prototypes -Wmissing-declarations -Winit-self -Wpointer-arith -Wold-style-definition -Wmissing-format-attribute -Wformat-security  -fno-common -fdiagnostics-show-option    conftest.c >&5
conftest.c:66:1: warning: function declaration isn't a prototype [-Wstrict-prototypes]
conftest.c: In function 'main':
conftest.c:66:1: warning: old-style function definition [-Wold-style-definition]
conftest.c:68:20: error: expected expression before ')' token
configure:14082: $? = 1
configure: failed program was:
| /* confdefs.h */
| #define PACKAGE_NAME "GIMP"
| #define PACKAGE_TARNAME "gimp"
| #define PACKAGE_VERSION "2.8.0"
| #define PACKAGE_STRING "GIMP 2.8.0"
| #define PACKAGE_BUGREPORT "http://bugzilla.gnome.org/enter_bug.cgi?product=GIMP"
| #define PACKAGE_URL ""
| #define GETTEXT_PACKAGE "gimp20"
| #define STDC_HEADERS 1
| #define HAVE_SYS_TYPES_H 1
| #define HAVE_SYS_STAT_H 1
| #define HAVE_STDLIB_H 1
| #define HAVE_STRING_H 1
| #define HAVE_MEMORY_H 1
| #define HAVE_STRINGS_H 1
| #define HAVE_INTTYPES_H 1
| #define HAVE_STDINT_H 1
| #define HAVE_UNISTD_H 1
| #define HAVE_DLFCN_H 1
| #define LT_OBJDIR ".libs/"
| #define ARCH_X86 1
| #define ARCH_X86_64 1
| #define STDC_HEADERS 1
| #define HAVE_SYS_WAIT_H 1
| #define TIME_WITH_SYS_TIME 1
| #define HAVE_SYS_PARAM_H 1
| #define HAVE_SYS_TIME_H 1
| #define HAVE_SYS_TIMES_H 1
| #define HAVE_SYS_WAIT_H 1
| #define HAVE_UNISTD_H 1
| /* end confdefs.h.  */
| #include <stdio.h>
| #ifdef HAVE_SYS_TYPES_H
| # include <sys/types.h>
| #endif
| #ifdef HAVE_SYS_STAT_H
| # include <sys/stat.h>
| #endif
| #ifdef STDC_HEADERS
| # include <stdlib.h>
| # include <stddef.h>
| #else
| # ifdef HAVE_STDLIB_H
| #  include <stdlib.h>
| # endif
| #endif
| #ifdef HAVE_STRING_H
| # if !defined STDC_HEADERS && defined HAVE_MEMORY_H
| #  include <memory.h>
| # endif
| # include <string.h>
| #endif
| #ifdef HAVE_STRINGS_H
| # include <strings.h>
| #endif
| #ifdef HAVE_INTTYPES_H
| # include <inttypes.h>
| #endif
| #ifdef HAVE_STDINT_H
| # include <stdint.h>
| #endif
| #ifdef HAVE_UNISTD_H
| # include <unistd.h>
| #endif
| int
| main ()
| {
| if (sizeof ((pid_t)))
| 	    return 0;
|   ;
|   return 0;
| }
configure:14082: result: yes
configure:14095: checking for vprintf
configure:14095: gcc -o conftest -g -O2 -Wall -Wdeclaration-after-statement -Wmissing-prototypes -Werror=missing-prototypes -Wstrict-prototypes -Wmissing-declarations -Winit-self -Wpointer-arith -Wold-style-definition -Wmissing-format-attribute -Wformat-security  -fno-common -fdiagnostics-show-option     conftest.c  >&5
conftest.c:55:1: warning: function declaration isn't a prototype [-Wstrict-prototypes]
conftest.c:55:6: warning: conflicting types for built-in function 'vprintf' [enabled by default]
conftest.c:64:1: warning: function declaration isn't a prototype [-Wstrict-prototypes]
conftest.c: In function 'main':
conftest.c:64:1: warning: old-style function definition [-Wold-style-definition]
configure:14095: $? = 0
configure:14095: result: yes
configure:14101: checking for _doprnt
configure:14101: gcc -o conftest -g -O2 -Wall -Wdeclaration-after-statement -Wmissing-prototypes -Werror=missing-prototypes -Wstrict-prototypes -Wmissing-declarations -Winit-self -Wpointer-arith -Wold-style-definition -Wmissing-format-attribute -Wformat-security  -fno-common -fdiagnostics-show-option     conftest.c  >&5
conftest.c:56:1: warning: function declaration isn't a prototype [-Wstrict-prototypes]
conftest.c:65:1: warning: function declaration isn't a prototype [-Wstrict-prototypes]
conftest.c: In function 'main':
conftest.c:65:1: warning: old-style function definition [-Wold-style-definition]
/tmp/cc3Lm1WI.o: In function `main':
/home/klaye/data/build/gimp-2.8.0/conftest.c:67: undefined reference to `_doprnt'
collect2: ld returned 1 exit status
configure:14101: $? = 1
configure: failed program was:
| /* confdefs.h */
| #define PACKAGE_NAME "GIMP"
| #define PACKAGE_TARNAME "gimp"
| #define PACKAGE_VERSION "2.8.0"
| #define PACKAGE_STRING "GIMP 2.8.0"
| #define PACKAGE_BUGREPORT "http://bugzilla.gnome.org/enter_bug.cgi?product=GIMP"
| #define PACKAGE_URL ""
| #define GETTEXT_PACKAGE "gimp20"
| #define STDC_HEADERS 1
| #define HAVE_SYS_TYPES_H 1
| #define HAVE_SYS_STAT_H 1
| #define HAVE_STDLIB_H 1
| #define HAVE_STRING_H 1
| #define HAVE_MEMORY_H 1
| #define HAVE_STRINGS_H 1
| #define HAVE_INTTYPES_H 1
| #define HAVE_STDINT_H 1
| #define HAVE_UNISTD_H 1
| #define HAVE_DLFCN_H 1
| #define LT_OBJDIR ".libs/"
| #define ARCH_X86 1
| #define ARCH_X86_64 1
| #define STDC_HEADERS 1
| #define HAVE_SYS_WAIT_H 1
| #define TIME_WITH_SYS_TIME 1
| #define HAVE_SYS_PARAM_H 1
| #define HAVE_SYS_TIME_H 1
| #define HAVE_SYS_TIMES_H 1
| #define HAVE_SYS_WAIT_H 1
| #define HAVE_UNISTD_H 1
| #define HAVE_VPRINTF 1
| /* end confdefs.h.  */
| /* Define _doprnt to an innocuous variant, in case <limits.h> declares _doprnt.
|    For example, HP-UX 11i <limits.h> declares gettimeofday.  */
| #define _doprnt innocuous__doprnt
| 
| /* System header to define __stub macros and hopefully few prototypes,
|     which can conflict with char _doprnt (); below.
|     Prefer <limits.h> to <assert.h> if __STDC__ is defined, since
|     <limits.h> exists even on freestanding compilers.  */
| 
| #ifdef __STDC__
| # include <limits.h>
| #else
| # include <assert.h>
| #endif
| 
| #undef _doprnt
| 
| /* Override any GCC internal prototype to avoid an error.
|    Use char because int might match the return type of a GCC
|    builtin and then its argument prototype would still apply.  */
| #ifdef __cplusplus
| extern "C"
| #endif
| char _doprnt ();
| /* The GNU C library defines this for functions which it implements
|     to always fail with ENOSYS.  Some functions are actually named
|     something starting with __ and the normal name is an alias.  */
| #if defined __stub__doprnt || defined __stub____doprnt
| choke me
| #endif
| 
| int
| main ()
| {
| return _doprnt ();
|   ;
|   return 0;
| }
configure:14101: result: no
configure:14113: checking for size_t
configure:14113: gcc -c -g -O2 -Wall -Wdeclaration-after-statement -Wmissing-prototypes -Werror=missing-prototypes -Wstrict-prototypes -Wmissing-declarations -Winit-self -Wpointer-arith -Wold-style-definition -Wmissing-format-attribute -Wformat-security  -fno-common -fdiagnostics-show-option    conftest.c >&5
conftest.c:67:1: warning: function declaration isn't a prototype [-Wstrict-prototypes]
conftest.c: In function 'main':
conftest.c:67:1: warning: old-style function definition [-Wold-style-definition]
configure:14113: $? = 0
configure:14113: gcc -c -g -O2 -Wall -Wdeclaration-after-statement -Wmissing-prototypes -Werror=missing-prototypes -Wstrict-prototypes -Wmissing-declarations -Winit-self -Wpointer-arith -Wold-style-definition -Wmissing-format-attribute -Wformat-security  -fno-common -fdiagnostics-show-option    conftest.c >&5
conftest.c:67:1: warning: function declaration isn't a prototype [-Wstrict-prototypes]
conftest.c: In function 'main':
conftest.c:67:1: warning: old-style function definition [-Wold-style-definition]
conftest.c:69:21: error: expected expression before ')' token
configure:14113: $? = 1
configure: failed program was:
| /* confdefs.h */
| #define PACKAGE_NAME "GIMP"
| #define PACKAGE_TARNAME "gimp"
| #define PACKAGE_VERSION "2.8.0"
| #define PACKAGE_STRING "GIMP 2.8.0"
| #define PACKAGE_BUGREPORT "http://bugzilla.gnome.org/enter_bug.cgi?product=GIMP"
| #define PACKAGE_URL ""
| #define GETTEXT_PACKAGE "gimp20"
| #define STDC_HEADERS 1
| #define HAVE_SYS_TYPES_H 1
| #define HAVE_SYS_STAT_H 1
| #define HAVE_STDLIB_H 1
| #define HAVE_STRING_H 1
| #define HAVE_MEMORY_H 1
| #define HAVE_STRINGS_H 1
| #define HAVE_INTTYPES_H 1
| #define HAVE_STDINT_H 1
| #define HAVE_UNISTD_H 1
| #define HAVE_DLFCN_H 1
| #define LT_OBJDIR ".libs/"
| #define ARCH_X86 1
| #define ARCH_X86_64 1
| #define STDC_HEADERS 1
| #define HAVE_SYS_WAIT_H 1
| #define TIME_WITH_SYS_TIME 1
| #define HAVE_SYS_PARAM_H 1
| #define HAVE_SYS_TIME_H 1
| #define HAVE_SYS_TIMES_H 1
| #define HAVE_SYS_WAIT_H 1
| #define HAVE_UNISTD_H 1
| #define HAVE_VPRINTF 1
| /* end confdefs.h.  */
| #include <stdio.h>
| #ifdef HAVE_SYS_TYPES_H
| # include <sys/types.h>
| #endif
| #ifdef HAVE_SYS_STAT_H
| # include <sys/stat.h>
| #endif
| #ifdef STDC_HEADERS
| # include <stdlib.h>
| # include <stddef.h>
| #else
| # ifdef HAVE_STDLIB_H
| #  include <stdlib.h>
| # endif
| #endif
| #ifdef HAVE_STRING_H
| # if !defined STDC_HEADERS && defined HAVE_MEMORY_H
| #  include <memory.h>
| # endif
| # include <string.h>
| #endif
| #ifdef HAVE_STRINGS_H
| # include <strings.h>
| #endif
| #ifdef HAVE_INTTYPES_H
| # include <inttypes.h>
| #endif
| #ifdef HAVE_STDINT_H
| # include <stdint.h>
| #endif
| #ifdef HAVE_UNISTD_H
| # include <unistd.h>
| #endif
| int
| main ()
| {
| if (sizeof ((size_t)))
| 	    return 0;
|   ;
|   return 0;
| }
configure:14113: result: yes
configure:14126: checking for working alloca.h
configure:14143: gcc -o conftest -g -O2 -Wall -Wdeclaration-after-statement -Wmissing-prototypes -Werror=missing-prototypes -Wstrict-prototypes -Wmissing-declarations -Winit-self -Wpointer-arith -Wold-style-definition -Wmissing-format-attribute -Wformat-security  -fno-common -fdiagnostics-show-option     conftest.c  >&5
conftest.c:35:1: warning: function declaration isn't a prototype [-Wstrict-prototypes]
conftest.c: In function 'main':
conftest.c:35:1: warning: old-style function definition [-Wold-style-definition]
configure:14143: $? = 0
configure:14151: result: yes
configure:14159: checking for alloca
configure:14196: gcc -o conftest -g -O2 -Wall -Wdeclaration-after-statement -Wmissing-prototypes -Werror=missing-prototypes -Wstrict-prototypes -Wmissing-declarations -Winit-self -Wpointer-arith -Wold-style-definition -Wmissing-format-attribute -Wformat-security  -fno-common -fdiagnostics-show-option     conftest.c  >&5
conftest.c:56:1: warning: function declaration isn't a prototype [-Wstrict-prototypes]
conftest.c: In function 'main':
conftest.c:56:1: warning: old-style function definition [-Wold-style-definition]
configure:14196: $? = 0
configure:14204: result: yes
configure:14317: checking for fsync
configure:14317: gcc -o conftest -g -O2 -Wall -Wdeclaration-after-statement -Wmissing-prototypes -Werror=missing-prototypes -Wstrict-prototypes -Wmissing-declarations -Winit-self -Wpointer-arith -Wold-style-definition -Wmissing-format-attribute -Wformat-security  -fno-common -fdiagnostics-show-option     conftest.c  >&5
conftest.c:58:1: warning: function declaration isn't a prototype [-Wstrict-prototypes]
conftest.c:67:1: warning: function declaration isn't a prototype [-Wstrict-prototypes]
conftest.c: In function 'main':
conftest.c:67:1: warning: old-style function definition [-Wold-style-definition]
configure:14317: $? = 0
configure:14317: result: yes
configure:14329: checking for difftime
configure:14329: gcc -o conftest -g -O2 -Wall -Wdeclaration-after-statement -Wmissing-prototypes -Werror=missing-prototypes -Wstrict-prototypes -Wmissing-declarations -Winit-self -Wpointer-arith -Wold-style-definition -Wmissing-format-attribute -Wformat-security  -fno-common -fdiagnostics-show-option     conftest.c  >&5
conftest.c:59:1: warning: function declaration isn't a prototype [-Wstrict-prototypes]
conftest.c:68:1: warning: function declaration isn't a prototype [-Wstrict-prototypes]
conftest.c: In function 'main':
conftest.c:68:1: warning: old-style function definition [-Wold-style-definition]
configure:14329: $? = 0
configure:14329: result: yes
configure:14329: checking for mmap
configure:14329: gcc -o conftest -g -O2 -Wall -Wdeclaration-after-statement -Wmissing-prototypes -Werror=missing-prototypes -Wstrict-prototypes -Wmissing-declarations -Winit-self -Wpointer-arith -Wold-style-definition -Wmissing-format-attribute -Wformat-security  -fno-common -fdiagnostics-show-option     conftest.c  >&5
conftest.c:60:1: warning: function declaration isn't a prototype [-Wstrict-prototypes]
conftest.c:69:1: warning: function declaration isn't a prototype [-Wstrict-prototypes]
conftest.c: In function 'main':
conftest.c:69:1: warning: old-style function definition [-Wold-style-definition]
configure:14329: $? = 0
configure:14329: result: yes
configure:14398: checking whether binary relocation support should be enabled
configure:14416: result: no
configure:14507: checking for _NL_MEASUREMENT_MEASUREMENT
configure:14520: gcc -o conftest -g -O2 -Wall -Wdeclaration-after-statement -Wmissing-prototypes -Werror=missing-prototypes -Wstrict-prototypes -Wmissing-declarations -Winit-self -Wpointer-arith -Wold-style-definition -Wmissing-format-attribute -Wformat-security  -fno-common -fdiagnostics-show-option     conftest.c  >&5
conftest.c:40:1: warning: function declaration isn't a prototype [-Wstrict-prototypes]
conftest.c: In function 'main':
conftest.c:40:1: warning: old-style function definition [-Wold-style-definition]
conftest.c:42:6: warning: unused variable 'c' [-Wunused-variable]
configure:14520: $? = 0
configure:14527: result: yes
configure:14541: checking whether NLS is requested
configure:14550: result: yes
configure:14568: checking for intltool >= 0.40.1
configure:14570: result: 0.41.1 found
configure:14578: checking for intltool-update
configure:14596: found /usr/bin/intltool-update
configure:14608: result: /usr/bin/intltool-update
configure:14618: checking for intltool-merge
configure:14636: found /usr/bin/intltool-merge
configure:14648: result: /usr/bin/intltool-merge
configure:14658: checking for intltool-extract
configure:14676: found /usr/bin/intltool-extract
configure:14688: result: /usr/bin/intltool-extract
configure:14842: checking for xgettext
configure:14860: found /usr/bin/xgettext
configure:14872: result: /usr/bin/xgettext
configure:14882: checking for msgmerge
configure:14900: found /usr/bin/msgmerge
configure:14912: result: /usr/bin/msgmerge
configure:14922: checking for msgfmt
configure:14940: found /usr/bin/msgfmt
configure:14952: result: /usr/bin/msgfmt
configure:14962: checking for gmsgfmt
configure:14993: result: /usr/bin/msgfmt
configure:15013: checking for perl
configure:15031: found /usr/bin/perl
configure:15043: result: /usr/bin/perl
configure:15054: checking for perl >= 5.8.1
configure:15061: result: 5.14.2
configure:15065: checking for XML::Parser
configure:15068: result: ok
configure:15093: gcc -o conftest -g -O2 -Wall -Wdeclaration-after-statement -Wmissing-prototypes -Werror=missing-prototypes -Wstrict-prototypes -Wmissing-declarations -Winit-self -Wpointer-arith -Wold-style-definition -Wmissing-format-attribute -Wformat-security  -fno-common -fdiagnostics-show-option     conftest.c  >&5
conftest.c:41:1: warning: function declaration isn't a prototype [-Wstrict-prototypes]
conftest.c: In function 'main':
conftest.c:41:1: warning: old-style function definition [-Wold-style-definition]
configure:15093: $? = 0
configure:15122: checking locale.h usability
configure:15122: gcc -c -g -O2 -Wall -Wdeclaration-after-statement -Wmissing-prototypes -Werror=missing-prototypes -Wstrict-prototypes -Wmissing-declarations -Winit-self -Wpointer-arith -Wold-style-definition -Wmissing-format-attribute -Wformat-security  -fno-common -fdiagnostics-show-option    conftest.c >&5
configure:15122: $? = 0
configure:15122: result: yes
configure:15122: checking locale.h presence
configure:15122: gcc -E  conftest.c
configure:15122: $? = 0
configure:15122: result: yes
configure:15122: checking for locale.h
configure:15122: result: yes
configure:15133: checking for LC_MESSAGES
configure:15149: gcc -o conftest -g -O2 -Wall -Wdeclaration-after-statement -Wmissing-prototypes -Werror=missing-prototypes -Wstrict-prototypes -Wmissing-declarations -Winit-self -Wpointer-arith -Wold-style-definition -Wmissing-format-attribute -Wformat-security  -fno-common -fdiagnostics-show-option     conftest.c  >&5
conftest.c:42:1: warning: function declaration isn't a prototype [-Wstrict-prototypes]
conftest.c: In function 'main':
conftest.c:42:1: warning: old-style function definition [-Wold-style-definition]
configure:15149: $? = 0
configure:15157: result: yes
configure:15174: checking libintl.h usability
configure:15174: gcc -c -g -O2 -Wall -Wdeclaration-after-statement -Wmissing-prototypes -Werror=missing-prototypes -Wstrict-prototypes -Wmissing-declarations -Winit-self -Wpointer-arith -Wold-style-definition -Wmissing-format-attribute -Wformat-security  -fno-common -fdiagnostics-show-option    conftest.c >&5
configure:15174: $? = 0
configure:15174: result: yes
configure:15174: checking libintl.h presence
configure:15174: gcc -E  conftest.c
configure:15174: $? = 0
configure:15174: result: yes
configure:15174: checking for libintl.h
configure:15174: result: yes
configure:15182: checking for ngettext in libc
configure:15200: gcc -o conftest -g -O2 -Wall -Wdeclaration-after-statement -Wmissing-prototypes -Werror=missing-prototypes -Wstrict-prototypes -Wmissing-declarations -Winit-self -Wpointer-arith -Wold-style-definition -Wmissing-format-attribute -Wformat-security  -fno-common -fdiagnostics-show-option     conftest.c  >&5
conftest.c:45:1: warning: function declaration isn't a prototype [-Wstrict-prototypes]
conftest.c: In function 'main':
conftest.c:45:1: warning: old-style function definition [-Wold-style-definition]
configure:15200: $? = 0
configure:15209: result: yes
configure:15213: checking for dgettext in libc
configure:15231: gcc -o conftest -g -O2 -Wall -Wdeclaration-after-statement -Wmissing-prototypes -Werror=missing-prototypes -Wstrict-prototypes -Wmissing-declarations -Winit-self -Wpointer-arith -Wold-style-definition -Wmissing-format-attribute -Wformat-security  -fno-common -fdiagnostics-show-option     conftest.c  >&5
conftest.c:45:1: warning: function declaration isn't a prototype [-Wstrict-prototypes]
conftest.c: In function 'main':
conftest.c:45:1: warning: old-style function definition [-Wold-style-definition]
configure:15231: $? = 0
configure:15240: result: yes
configure:15247: checking for bind_textdomain_codeset
configure:15247: gcc -o conftest -g -O2 -Wall -Wdeclaration-after-statement -Wmissing-prototypes -Werror=missing-prototypes -Wstrict-prototypes -Wmissing-declarations -Winit-self -Wpointer-arith -Wold-style-definition -Wmissing-format-attribute -Wformat-security  -fno-common -fdiagnostics-show-option     conftest.c  >&5
conftest.c:64:1: warning: function declaration isn't a prototype [-Wstrict-prototypes]
conftest.c:73:1: warning: function declaration isn't a prototype [-Wstrict-prototypes]
conftest.c: In function 'main':
conftest.c:73:1: warning: old-style function definition [-Wold-style-definition]
configure:15247: $? = 0
configure:15247: result: yes
configure:15523: checking for msgfmt
configure:15550: result: /usr/bin/msgfmt
configure:15561: checking for dcgettext
configure:15561: gcc -o conftest -g -O2 -Wall -Wdeclaration-after-statement -Wmissing-prototypes -Werror=missing-prototypes -Wstrict-prototypes -Wmissing-declarations -Winit-self -Wpointer-arith -Wold-style-definition -Wmissing-format-attribute -Wformat-security  -fno-common -fdiagnostics-show-option     conftest.c   >&5
conftest.c:66:1: warning: function declaration isn't a prototype [-Wstrict-prototypes]
conftest.c:66:6: warning: conflicting types for built-in function 'dcgettext' [enabled by default]
conftest.c:75:1: warning: function declaration isn't a prototype [-Wstrict-prototypes]
conftest.c: In function 'main':
conftest.c:75:1: warning: old-style function definition [-Wold-style-definition]
configure:15561: $? = 0
configure:15561: result: yes
configure:15571: checking if msgfmt accepts -c
configure:15586: $MSGFMT -c -o /dev/null conftest.foo
configure:15589: $? = 0
configure:15591: result: yes
configure:15601: checking for gmsgfmt
configure:15632: result: /usr/bin/msgfmt
configure:15642: checking for xgettext
configure:15669: result: /usr/bin/xgettext
configure:15688: gcc -o conftest -g -O2 -Wall -Wdeclaration-after-statement -Wmissing-prototypes -Werror=missing-prototypes -Wstrict-prototypes -Wmissing-declarations -Winit-self -Wpointer-arith -Wold-style-definition -Wmissing-format-attribute -Wformat-security  -fno-common -fdiagnostics-show-option     conftest.c   >&5
conftest.c:46:1: warning: function declaration isn't a prototype [-Wstrict-prototypes]
conftest.c: In function 'main':
conftest.c:46:1: warning: old-style function definition [-Wold-style-definition]
configure:15688: $? = 0
configure:15833: checking for iso-codes
configure:15836: $PKG_CONFIG --exists --print-errors "iso-codes"
Package iso-codes was not found in the pkg-config search path.
Perhaps you should add the directory containing `iso-codes.pc'
to the PKG_CONFIG_PATH environment variable
No package 'iso-codes' found
configure:15839: $? = 1
configure:15851: result: no (iso-codes package not found)
configure:15864: checking for BABL
configure:15871: $PKG_CONFIG --exists --print-errors "babl >= 0.1.10"
configure:15874: $? = 0
configure:15888: $PKG_CONFIG --exists --print-errors "babl >= 0.1.10"
configure:15891: $? = 0
configure:15949: result: yes
configure:15955: checking for GEGL
configure:15962: $PKG_CONFIG --exists --print-errors "gegl-0.2 >= 0.2.0"
configure:15965: $? = 0
configure:15979: $PKG_CONFIG --exists --print-errors "gegl-0.2 >= 0.2.0"
configure:15982: $? = 0
configure:16040: result: yes
configure:16046: checking for ATK
configure:16053: $PKG_CONFIG --exists --print-errors "atk >= 2.2.0"
TO BE CONTINUED AGAIN
 
Old 05-11-2012, 02:34 AM   #4
Knightron
Senior Member
 
Registered: Jan 2011
Location: Planet Earth
Distribution: Slackware.
Posts: 1,339
Blog Entries: 7

Original Poster
Rep: Reputation: 159Reputation: 159
Code:
configure:16056: $? = 0
configure:16070: $PKG_CONFIG --exists --print-errors "atk >= 2.2.0"
configure:16073: $? = 0
configure:16131: result: yes
configure:16220: checking for pkg-config
configure:16250: result: /usr/bin/pkg-config
configure:16275: checking pkg-config is at least version 0.16
configure:16278: result: yes
configure:16295: checking for GLIB - version >= 2.30.2
configure:16410: gcc -o conftest -g -O2 -Wall -Wdeclaration-after-statement -Wmissing-prototypes -Werror=missing-prototypes -Wstrict-prototypes -Wmissing-declarations -Winit-self -Wpointer-arith -Wold-style-definition -Wmissing-format-attribute -Wformat-security  -fno-common -fdiagnostics-show-option   -pthread -I/usr/include/glib-2.0 -I/usr/lib64/glib-2.0/include     conftest.c -pthread -lgobject-2.0 -lgthread-2.0 -lrt -lglib-2.0    >&5
conftest.c:51:1: warning: function declaration isn't a prototype [-Wstrict-prototypes]
conftest.c: In function 'main':
conftest.c:51:1: warning: old-style function definition [-Wold-style-definition]
configure:16410: $? = 0
configure:16410: ./conftest
configure:16410: $? = 0
configure:16424: result: yes (version 2.30.2)
configure:16495: checking for GMODULE_NO_EXPORT
configure:16502: $PKG_CONFIG --exists --print-errors "gmodule-no-export-2.0"
configure:16505: $? = 0
configure:16519: $PKG_CONFIG --exists --print-errors "gmodule-no-export-2.0"
configure:16522: $? = 0
configure:16580: result: yes
configure:16587: checking for GIO
configure:16594: $PKG_CONFIG --exists --print-errors "gio-2.0"
configure:16597: $? = 0
configure:16611: $PKG_CONFIG --exists --print-errors "gio-2.0"
configure:16614: $? = 0
configure:16672: result: yes
configure:16677: checking if GLib is version 2.31.0 or newer
configure:16684: result: no
configure:16693: checking for bind_textdomain_codeset
configure:16693: result: yes
configure:16709: checking for X
configure:16848: gcc -o conftest -g -O2 -Wall -Wdeclaration-after-statement -Wmissing-prototypes -Werror=missing-prototypes -Wstrict-prototypes -Wmissing-declarations -Winit-self -Wpointer-arith -Wold-style-definition -Wmissing-format-attribute -Wformat-security  -fno-common -fdiagnostics-show-option     conftest.c -lX11  >&5
conftest.c:48:1: warning: function declaration isn't a prototype [-Wstrict-prototypes]
conftest.c: In function 'main':
conftest.c:48:1: warning: old-style function definition [-Wold-style-definition]
configure:16848: $? = 0
configure:16898: result: libraries , headers 
configure:16997: gcc -o conftest -g -O2 -Wall -Wdeclaration-after-statement -Wmissing-prototypes -Werror=missing-prototypes -Wstrict-prototypes -Wmissing-declarations -Winit-self -Wpointer-arith -Wold-style-definition -Wmissing-format-attribute -Wformat-security  -fno-common -fdiagnostics-show-option     conftest.c   -lX11 >&5
conftest.c:53:1: warning: function declaration isn't a prototype [-Wstrict-prototypes]
conftest.c:55:1: warning: function declaration isn't a prototype [-Wstrict-prototypes]
conftest.c: In function 'main':
conftest.c:55:1: warning: old-style function definition [-Wold-style-definition]
configure:16997: $? = 0
configure:17095: checking for gethostbyname
configure:17095: gcc -o conftest -g -O2 -Wall -Wdeclaration-after-statement -Wmissing-prototypes -Werror=missing-prototypes -Wstrict-prototypes -Wmissing-declarations -Winit-self -Wpointer-arith -Wold-style-definition -Wmissing-format-attribute -Wformat-security  -fno-common -fdiagnostics-show-option     conftest.c  >&5
conftest.c:69:1: warning: function declaration isn't a prototype [-Wstrict-prototypes]
conftest.c:78:1: warning: function declaration isn't a prototype [-Wstrict-prototypes]
conftest.c: In function 'main':
conftest.c:78:1: warning: old-style function definition [-Wold-style-definition]
configure:17095: $? = 0
configure:17095: result: yes
configure:17192: checking for connect
configure:17192: gcc -o conftest -g -O2 -Wall -Wdeclaration-after-statement -Wmissing-prototypes -Werror=missing-prototypes -Wstrict-prototypes -Wmissing-declarations -Winit-self -Wpointer-arith -Wold-style-definition -Wmissing-format-attribute -Wformat-security  -fno-common -fdiagnostics-show-option     conftest.c  >&5
conftest.c:69:1: warning: function declaration isn't a prototype [-Wstrict-prototypes]
conftest.c:78:1: warning: function declaration isn't a prototype [-Wstrict-prototypes]
conftest.c: In function 'main':
conftest.c:78:1: warning: old-style function definition [-Wold-style-definition]
configure:17192: $? = 0
configure:17192: result: yes
configure:17241: checking for remove
configure:17241: gcc -o conftest -g -O2 -Wall -Wdeclaration-after-statement -Wmissing-prototypes -Werror=missing-prototypes -Wstrict-prototypes -Wmissing-declarations -Winit-self -Wpointer-arith -Wold-style-definition -Wmissing-format-attribute -Wformat-security  -fno-common -fdiagnostics-show-option     conftest.c  >&5
conftest.c:69:1: warning: function declaration isn't a prototype [-Wstrict-prototypes]
conftest.c:78:1: warning: function declaration isn't a prototype [-Wstrict-prototypes]
conftest.c: In function 'main':
conftest.c:78:1: warning: old-style function definition [-Wold-style-definition]
configure:17241: $? = 0
configure:17241: result: yes
configure:17290: checking for shmat
configure:17290: gcc -o conftest -g -O2 -Wall -Wdeclaration-after-statement -Wmissing-prototypes -Werror=missing-prototypes -Wstrict-prototypes -Wmissing-declarations -Winit-self -Wpointer-arith -Wold-style-definition -Wmissing-format-attribute -Wformat-security  -fno-common -fdiagnostics-show-option     conftest.c  >&5
conftest.c:69:1: warning: function declaration isn't a prototype [-Wstrict-prototypes]
conftest.c:78:1: warning: function declaration isn't a prototype [-Wstrict-prototypes]
conftest.c: In function 'main':
conftest.c:78:1: warning: old-style function definition [-Wold-style-definition]
configure:17290: $? = 0
configure:17290: result: yes
configure:17348: checking for IceConnectionNumber in -lICE
configure:17373: gcc -o conftest -g -O2 -Wall -Wdeclaration-after-statement -Wmissing-prototypes -Werror=missing-prototypes -Wstrict-prototypes -Wmissing-declarations -Winit-self -Wpointer-arith -Wold-style-definition -Wmissing-format-attribute -Wformat-security  -fno-common -fdiagnostics-show-option     conftest.c -lICE   >&5
conftest.c:53:1: warning: function declaration isn't a prototype [-Wstrict-prototypes]
conftest.c:55:1: warning: function declaration isn't a prototype [-Wstrict-prototypes]
conftest.c: In function 'main':
conftest.c:55:1: warning: old-style function definition [-Wold-style-definition]
configure:17373: $? = 0
configure:17382: result: yes
configure:17415: checking for pkg-config
configure:17446: result: /usr/bin/pkg-config
configure:17468: checking for GTK+ - version >= 2.24.10
configure:17578: gcc -o conftest -g -O2 -Wall -Wdeclaration-after-statement -Wmissing-prototypes -Werror=missing-prototypes -Wstrict-prototypes -Wmissing-declarations -Winit-self -Wpointer-arith -Wold-style-definition -Wmissing-format-attribute -Wformat-security  -fno-common -fdiagnostics-show-option   -pthread -I/usr/include/gtk-2.0 -I/usr/lib64/gtk-2.0/include -I/usr/include/atk-1.0 -I/usr/include/cairo -I/usr/include/gdk-pixbuf-2.0 -I/usr/include/pango-1.0 -I/usr/include/glib-2.0 -I/usr/lib64/glib-2.0/include -I/usr/include/pixman-1 -I/usr/include/freetype2 -I/usr/include/libpng14     conftest.c -pthread -lgtk-x11-2.0 -lgdk-x11-2.0 -latk-1.0 -lgio-2.0 -lpangoft2-1.0 -lpangocairo-1.0 -lgdk_pixbuf-2.0 -lcairo -lpango-1.0 -lfreetype -lfontconfig -lgobject-2.0 -lgmodule-2.0 -lgthread-2.0 -lrt -lglib-2.0    >&5
In file included from /usr/include/gtk-2.0/gtk/gtk.h:234:0,
                 from conftest.c:47:
/usr/include/gtk-2.0/gtk/gtkitemfactory.h:47:1: warning: function declaration isn't a prototype [-Wstrict-prototypes]
conftest.c:52:1: warning: function declaration isn't a prototype [-Wstrict-prototypes]
conftest.c: In function 'main':
conftest.c:52:1: warning: old-style function definition [-Wold-style-definition]
/usr/lib64/gcc/x86_64-suse-linux/4.6/../../../../lib64/libgdk-x11-2.0.so: undefined reference to `g_mutex_new'
/usr/lib64/gcc/x86_64-suse-linux/4.6/../../../../lib64/libgtk-x11-2.0.so: undefined reference to `g_mutex_unlock'
/usr/lib64/gcc/x86_64-suse-linux/4.6/../../../../lib64/libgtk-x11-2.0.so: undefined reference to `g_mutex_lock'
/usr/lib64/gcc/x86_64-suse-linux/4.6/../../../../lib64/libgtk-x11-2.0.so: undefined reference to `g_thread_create'
collect2: ld returned 1 exit status
configure:17578: $? = 1
configure: program exited with status 1
configure: failed program was:
| /* confdefs.h */
| #define PACKAGE_NAME "GIMP"
| #define PACKAGE_TARNAME "gimp"
| #define PACKAGE_VERSION "2.8.0"
| #define PACKAGE_STRING "GIMP 2.8.0"
| #define PACKAGE_BUGREPORT "http://bugzilla.gnome.org/enter_bug.cgi?product=GIMP"
| #define PACKAGE_URL ""
| #define GETTEXT_PACKAGE "gimp20"
| #define STDC_HEADERS 1
| #define HAVE_SYS_TYPES_H 1
| #define HAVE_SYS_STAT_H 1
| #define HAVE_STDLIB_H 1
| #define HAVE_STRING_H 1
| #define HAVE_MEMORY_H 1
| #define HAVE_STRINGS_H 1
| #define HAVE_INTTYPES_H 1
| #define HAVE_STDINT_H 1
| #define HAVE_UNISTD_H 1
| #define HAVE_DLFCN_H 1
| #define LT_OBJDIR ".libs/"
| #define ARCH_X86 1
| #define ARCH_X86_64 1
| #define STDC_HEADERS 1
| #define HAVE_SYS_WAIT_H 1
| #define TIME_WITH_SYS_TIME 1
| #define HAVE_SYS_PARAM_H 1
| #define HAVE_SYS_TIME_H 1
| #define HAVE_SYS_TIMES_H 1
| #define HAVE_SYS_WAIT_H 1
| #define HAVE_UNISTD_H 1
| #define HAVE_VPRINTF 1
| #define HAVE_ALLOCA_H 1
| #define HAVE_ALLOCA 1
| #define HAVE_FSYNC 1
| #define HAVE_DIFFTIME 1
| #define HAVE_MMAP 1
| #define HAVE__NL_MEASUREMENT_MEASUREMENT 1
| #define HAVE_LOCALE_H 1
| #define HAVE_LC_MESSAGES 1
| #define HAVE_BIND_TEXTDOMAIN_CODESET 1
| #define HAVE_GETTEXT 1
| #define HAVE_DCGETTEXT 1
| #define ENABLE_NLS 1
| #define HAVE_BIND_TEXTDOMAIN_CODESET 1
| /* end confdefs.h.  */
| 
| #include <gtk/gtk.h>
| #include <stdio.h>
| #include <stdlib.h>
| 
| int
| main ()
| {
|   int major, minor, micro;
|   char *tmp_version;
| 
|   fclose (fopen ("conf.gtktest", "w"));
| 
|   /* HP/UX 9 (%@#!) writes to sscanf strings */
|   tmp_version = g_strdup("2.24.10");
|   if (sscanf(tmp_version, "%d.%d.%d", &major, &minor, &micro) != 3) {
|      printf("%s, bad version string\n", "2.24.10");
|      exit(1);
|    }
| 
|   if ((gtk_major_version != 2) ||
|       (gtk_minor_version != 24) ||
|       (gtk_micro_version != 10))
|     {
|       printf("\n*** 'pkg-config --modversion gtk+-2.0' returned %d.%d.%d, but GTK+ (%d.%d.%d)\n",
|              2, 24, 10,
|              gtk_major_version, gtk_minor_version, gtk_micro_version);
|       printf ("*** was found! If pkg-config was correct, then it is best\n");
|       printf ("*** to remove the old version of GTK+. You may also be able to fix the error\n");
|       printf("*** by modifying your LD_LIBRARY_PATH enviroment variable, or by editing\n");
|       printf("*** /etc/ld.so.conf. Make sure you have run ldconfig if that is\n");
|       printf("*** required on your system.\n");
|       printf("*** If pkg-config was wrong, set the environment variable PKG_CONFIG_PATH\n");
|       printf("*** to point to the correct configuration files\n");
|     }
|   else if ((gtk_major_version != GTK_MAJOR_VERSION) ||
| 	   (gtk_minor_version != GTK_MINOR_VERSION) ||
|            (gtk_micro_version != GTK_MICRO_VERSION))
|     {
|       printf("*** GTK+ header files (version %d.%d.%d) do not match\n",
| 	     GTK_MAJOR_VERSION, GTK_MINOR_VERSION, GTK_MICRO_VERSION);
|       printf("*** library (version %d.%d.%d)\n",
| 	     gtk_major_version, gtk_minor_version, gtk_micro_version);
|     }
|   else
|     {
|       if ((gtk_major_version > major) ||
|         ((gtk_major_version == major) && (gtk_minor_version > minor)) ||
|         ((gtk_major_version == major) && (gtk_minor_version == minor) && (gtk_micro_version >= micro)))
|       {
|         return 0;
|        }
|      else
|       {
|         printf("\n*** An old version of GTK+ (%d.%d.%d) was found.\n",
|                gtk_major_version, gtk_minor_version, gtk_micro_version);
|         printf("*** You need a version of GTK+ newer than %d.%d.%d. The latest version of\n",
| 	       major, minor, micro);
|         printf("*** GTK+ is always available from ftp://ftp.gtk.org.\n");
|         printf("***\n");
|         printf("*** If you have already installed a sufficiently new version, this error\n");
|         printf("*** probably means that the wrong copy of the pkg-config shell script is\n");
|         printf("*** being found. The easiest way to fix this is to remove the old version\n");
|         printf("*** of GTK+, but you can also set the PKG_CONFIG environment to point to the\n");
|         printf("*** correct copy of pkg-config. (In this case, you will have to\n");
|         printf("*** modify your LD_LIBRARY_PATH enviroment variable, or edit /etc/ld.so.conf\n");
|         printf("*** so that the correct libraries are found at run-time))\n");
|       }
|     }
|   return 1;
| }
| 
configure:17596: result: no
configure:17624: gcc -o conftest -g -O2 -Wall -Wdeclaration-after-statement -Wmissing-prototypes -Werror=missing-prototypes -Wstrict-prototypes -Wmissing-declarations -Winit-self -Wpointer-arith -Wold-style-definition -Wmissing-format-attribute -Wformat-security  -fno-common -fdiagnostics-show-option   -pthread -I/usr/include/gtk-2.0 -I/usr/lib64/gtk-2.0/include -I/usr/include/atk-1.0 -I/usr/include/cairo -I/usr/include/gdk-pixbuf-2.0 -I/usr/include/pango-1.0 -I/usr/include/glib-2.0 -I/usr/lib64/glib-2.0/include -I/usr/include/pixman-1 -I/usr/include/freetype2 -I/usr/include/libpng14     conftest.c  -pthread -lgtk-x11-2.0 -lgdk-x11-2.0 -latk-1.0 -lgio-2.0 -lpangoft2-1.0 -lpangocairo-1.0 -lgdk_pixbuf-2.0 -lcairo -lpango-1.0 -lfreetype -lfontconfig -lgobject-2.0 -lgmodule-2.0 -
lgthread-2.0 -lrt -lglib-2.0   >&5
In file included from /usr/include/gtk-2.0/gtk/gtk.h:234:0,
                 from conftest.c:47:
/usr/include/gtk-2.0/gtk/gtkitemfactory.h:47:1: warning: function declaration isn't a prototype [-Wstrict-prototypes]
conftest.c:51:1: warning: function declaration isn't a prototype [-Wstrict-prototypes]
conftest.c: In function 'main':
conftest.c:51:1: warning: old-style function definition [-Wold-style-definition]
/usr/lib64/gcc/x86_64-suse-linux/4.6/../../../../lib64/libgdk-x11-2.0.so: undefined reference to `g_mutex_new'
/usr/lib64/gcc/x86_64-suse-linux/4.6/../../../../lib64/libgtk-x11-2.0.so: undefined reference to `g_mutex_unlock'
/usr/lib64/gcc/x86_64-suse-linux/4.6/../../../../lib64/libgtk-x11-2.0.so: undefined reference to `g_mutex_lock'
/usr/lib64/gcc/x86_64-suse-linux/4.6/../../../../lib64/libgtk-x11-2.0.so: undefined reference to `g_thread_create'
collect2: ld returned 1 exit status
configure:17624: $? = 1
configure: failed program was:
| /* confdefs.h */
| #define PACKAGE_NAME "GIMP"
| #define PACKAGE_TARNAME "gimp"
| #define PACKAGE_VERSION "2.8.0"
| #define PACKAGE_STRING "GIMP 2.8.0"
| #define PACKAGE_BUGREPORT "http://bugzilla.gnome.org/enter_bug.cgi?product=GIMP"
| #define PACKAGE_URL ""
| #define GETTEXT_PACKAGE "gimp20"
| #define STDC_HEADERS 1
| #define HAVE_SYS_TYPES_H 1
| #define HAVE_SYS_STAT_H 1
| #define HAVE_STDLIB_H 1
| #define HAVE_STRING_H 1
| #define HAVE_MEMORY_H 1
| #define HAVE_STRINGS_H 1
| #define HAVE_INTTYPES_H 1
| #define HAVE_STDINT_H 1
| #define HAVE_UNISTD_H 1
| #define HAVE_DLFCN_H 1
| #define LT_OBJDIR ".libs/"
| #define ARCH_X86 1
| #define ARCH_X86_64 1
| #define STDC_HEADERS 1
| #define HAVE_SYS_WAIT_H 1
| #define TIME_WITH_SYS_TIME 1
| #define HAVE_SYS_PARAM_H 1
| #define HAVE_SYS_TIME_H 1
| #define HAVE_SYS_TIMES_H 1
| #define HAVE_SYS_WAIT_H 1
| #define HAVE_UNISTD_H 1
| #define HAVE_VPRINTF 1
| #define HAVE_ALLOCA_H 1
| #define HAVE_ALLOCA 1
| #define HAVE_FSYNC 1
| #define HAVE_DIFFTIME 1
| #define HAVE_MMAP 1
| #define HAVE__NL_MEASUREMENT_MEASUREMENT 1
| #define HAVE_LOCALE_H 1
| #define HAVE_LC_MESSAGES 1
| #define HAVE_BIND_TEXTDOMAIN_CODESET 1
| #define HAVE_GETTEXT 1
| #define HAVE_DCGETTEXT 1
| #define ENABLE_NLS 1
| #define HAVE_BIND_TEXTDOMAIN_CODESET 1
| /* end confdefs.h.  */
| 
| #include <gtk/gtk.h>
| #include <stdio.h>
| 
| int
| main ()
| {
|  return ((gtk_major_version) || (gtk_minor_version) || (gtk_micro_version));
|   ;
|   return 0;
| }
configure:17646: error: Test for GTK+ failed. See the file 'INSTALL' for help.

## ---------------- ##
## Cache variables. ##
## ---------------- ##

ac_cv_build=x86_64-unknown-linux-gnu
ac_cv_c_compiler_gnu=yes
ac_cv_env_ATK_CFLAGS_set=
ac_cv_env_ATK_CFLAGS_value=
ac_cv_env_ATK_LIBS_set=
ac_cv_env_ATK_LIBS_value=
ac_cv_env_BABL_CFLAGS_set=
ac_cv_env_BABL_CFLAGS_value=
ac_cv_env_BABL_LIBS_set=
ac_cv_env_BABL_LIBS_value=
ac_cv_env_CAIRO_CFLAGS_set=
ac_cv_env_CAIRO_CFLAGS_value=
ac_cv_env_CAIRO_LIBS_set=
ac_cv_env_CAIRO_LIBS_value=
ac_cv_env_CAIRO_PDF_CFLAGS_set=
ac_cv_env_CAIRO_PDF_CFLAGS_value=
ac_cv_env_CAIRO_PDF_LIBS_set=
ac_cv_env_CAIRO_PDF_LIBS_value=
ac_cv_env_CCASFLAGS_set=
ac_cv_env_CCASFLAGS_value=
ac_cv_env_CCAS_set=
ac_cv_env_CCAS_value=
ac_cv_env_CC_set=
ac_cv_env_CC_value=
ac_cv_env_CFLAGS_set=
ac_cv_env_CFLAGS_value=
ac_cv_env_CPPFLAGS_set=
ac_cv_env_CPPFLAGS_value=
ac_cv_env_CPP_set=
ac_cv_env_CPP_value=
ac_cv_env_CURL_CFLAGS_set=
ac_cv_env_CURL_CFLAGS_value=
ac_cv_env_CURL_LIBS_set=
ac_cv_env_CURL_LIBS_value=
ac_cv_env_DBUS_GLIB_CFLAGS_set=
ac_cv_env_DBUS_GLIB_CFLAGS_value=
ac_cv_env_DBUS_GLIB_LIBS_set=
ac_cv_env_DBUS_GLIB_LIBS_value=
ac_cv_env_EXIF_CFLAGS_set=
ac_cv_env_EXIF_CFLAGS_value=
ac_cv_env_EXIF_LIBS_set=
ac_cv_env_EXIF_LIBS_value=
ac_cv_env_FONTCONFIG_CFLAGS_set=
ac_cv_env_FONTCONFIG_CFLAGS_value=
ac_cv_env_FONTCONFIG_LIBS_set=
ac_cv_env_FONTCONFIG_LIBS_value=
ac_cv_env_GDK_PIXBUF_CFLAGS_set=
ac_cv_env_GDK_PIXBUF_CFLAGS_value=
ac_cv_env_GDK_PIXBUF_LIBS_set=
ac_cv_env_GDK_PIXBUF_LIBS_value=
ac_cv_env_GEGL_CFLAGS_set=
ac_cv_env_GEGL_CFLAGS_value=
ac_cv_env_GEGL_LIBS_set=
ac_cv_env_GEGL_LIBS_value=
ac_cv_env_GIO_CFLAGS_set=
ac_cv_env_GIO_CFLAGS_value=
ac_cv_env_GIO_LIBS_set=
ac_cv_env_GIO_LIBS_value=
ac_cv_env_GMODULE_NO_EXPORT_CFLAGS_set=
ac_cv_env_GMODULE_NO_EXPORT_CFLAGS_value=
ac_cv_env_GMODULE_NO_EXPORT_LIBS_set=
ac_cv_env_GMODULE_NO_EXPORT_LIBS_value=
ac_cv_env_GTKDOC_DEPS_CFLAGS_set=
ac_cv_env_GTKDOC_DEPS_CFLAGS_value=
ac_cv_env_GTKDOC_DEPS_LIBS_set=
ac_cv_env_GTKDOC_DEPS_LIBS_value=
ac_cv_env_GUDEV_CFLAGS_set=
ac_cv_env_GUDEV_CFLAGS_value=
ac_cv_env_GUDEV_LIBS_set=
ac_cv_env_GUDEV_LIBS_value=
ac_cv_env_LCMS_CFLAGS_set=
ac_cv_env_LCMS_CFLAGS_value=
ac_cv_env_LCMS_LIBS_set=
ac_cv_env_LCMS_LIBS_value=
ac_cv_env_LDFLAGS_set=
ac_cv_env_LDFLAGS_value=
ac_cv_env_LIBS_set=
ac_cv_env_LIBS_value=
ac_cv_env_PANGOCAIRO_CFLAGS_set=
ac_cv_env_PANGOCAIRO_CFLAGS_value=
ac_cv_env_PANGOCAIRO_LIBS_set=
ac_cv_env_PANGOCAIRO_LIBS_value=
ac_cv_env_PKG_CONFIG_LIBDIR_set=
ac_cv_env_PKG_CONFIG_LIBDIR_value=
ac_cv_env_PKG_CONFIG_PATH_set=
ac_cv_env_PKG_CONFIG_PATH_value=
ac_cv_env_PKG_CONFIG_set=
ac_cv_env_PKG_CONFIG_value=
ac_cv_env_PNG_CFLAGS_set=
ac_cv_env_PNG_CFLAGS_value=
ac_cv_env_PNG_LIBS_set=
ac_cv_env_PNG_LIBS_value=
ac_cv_env_POPPLER_CFLAGS_set=
ac_cv_env_POPPLER_CFLAGS_value=
ac_cv_env_POPPLER_LIBS_set=
ac_cv_env_POPPLER_LIBS_value=
ac_cv_env_PYGTK_CFLAGS_set=
ac_cv_env_PYGTK_CFLAGS_value=
ac_cv_env_PYGTK_LIBS_set=
ac_cv_env_PYGTK_LIBS_value=
ac_cv_env_PYTHON_set=
ac_cv_env_PYTHON_value=
ac_cv_env_SVG_CFLAGS_set=
ac_cv_env_SVG_CFLAGS_value=
ac_cv_env_SVG_LIBS_set=
ac_cv_env_SVG_LIBS_value=
ac_cv_env_WEBKIT_CFLAGS_set=
ac_cv_env_WEBKIT_CFLAGS_value=
ac_cv_env_WEBKIT_LIBS_set=
ac_cv_env_WEBKIT_LIBS_value=
ac_cv_env_XFIXES_CFLAGS_set=
ac_cv_env_XFIXES_CFLAGS_value=
ac_cv_env_XFIXES_LIBS_set=
ac_cv_env_XFIXES_LIBS_value=
ac_cv_env_XMC_CFLAGS_set=
ac_cv_env_XMC_CFLAGS_value=
ac_cv_env_XMC_LIBS_set=
ac_cv_env_XMC_LIBS_value=
ac_cv_env_XMKMF_set=
ac_cv_env_XMKMF_value=
ac_cv_env_build_alias_set=
ac_cv_env_build_alias_value=
ac_cv_env_host_alias_set=
ac_cv_env_host_alias_value=
ac_cv_env_target_alias_set=
ac_cv_env_target_alias_value=
ac_cv_func__doprnt=no
ac_cv_func_alloca_works=yes
ac_cv_func_bind_textdomain_codeset=yes
ac_cv_func_connect=yes
ac_cv_func_dcgettext=yes
ac_cv_func_difftime=yes
ac_cv_func_fsync=yes
ac_cv_func_gethostbyname=yes
ac_cv_func_mmap=yes
ac_cv_func_remove=yes
ac_cv_func_shmat=yes
ac_cv_func_vprintf=yes
ac_cv_have_x='have_x=yes	ac_x_includes='\'''\''	ac_x_libraries='\'''\'''
ac_cv_header_dlfcn_h=yes
ac_cv_header_inttypes_h=yes
ac_cv_header_libintl_h=yes
ac_cv_header_locale_h=yes
ac_cv_header_memory_h=yes
ac_cv_header_stdc=yes
ac_cv_header_stdint_h=yes
ac_cv_header_stdlib_h=yes
ac_cv_header_string_h=yes
ac_cv_header_strings_h=yes
ac_cv_header_sys_param_h=yes
ac_cv_header_sys_stat_h=yes
ac_cv_header_sys_time_h=yes
ac_cv_header_sys_times_h=yes
ac_cv_header_sys_types_h=yes
ac_cv_header_sys_wait_h=yes
ac_cv_header_time=yes
ac_cv_header_unistd_h=yes
ac_cv_host=x86_64-unknown-linux-gnu
ac_cv_lib_ICE_IceConnectionNumber=yes
ac_cv_objext=o
ac_cv_path_EGREP='/usr/bin/grep -E'
ac_cv_path_FGREP='/usr/bin/grep -F'
ac_cv_path_GMSGFMT=/usr/bin/msgfmt
ac_cv_path_GREP=/usr/bin/grep
ac_cv_path_INTLTOOL_EXTRACT=/usr/bin/intltool-extract
ac_cv_path_INTLTOOL_MERGE=/usr/bin/intltool-merge
ac_cv_path_INTLTOOL_PERL=/usr/bin/perl
ac_cv_path_INTLTOOL_UPDATE=/usr/bin/intltool-update
ac_cv_path_MSGFMT=/usr/bin/msgfmt
ac_cv_path_MSGMERGE=/usr/bin/msgmerge
ac_cv_path_PKG_CONFIG=/usr/bin/pkg-config
ac_cv_path_SED=/usr/bin/sed
ac_cv_path_XGETTEXT=/usr/bin/xgettext
ac_cv_path_ac_pt_PKG_CONFIG=/usr/bin/pkg-config
ac_cv_path_install='/usr/bin/install -c'
ac_cv_path_mkdir=/bin/mkdir
ac_cv_prog_AWK=gawk
ac_cv_prog_CPP='gcc -E'
ac_cv_prog_ac_ct_AR=ar
ac_cv_prog_ac_ct_CC=gcc
ac_cv_prog_ac_ct_MANIFEST_TOOL=mt
ac_cv_prog_ac_ct_OBJDUMP=objdump
ac_cv_prog_ac_ct_RANLIB=ranlib
ac_cv_prog_ac_ct_STRIP=strip
ac_cv_prog_cc_c89=
ac_cv_prog_cc_g=yes
ac_cv_prog_cc_gcc_c_o=yes
ac_cv_prog_make_make_set=yes
ac_cv_sys_file_offset_bits=no
ac_cv_sys_largefile_CC=no
ac_cv_type_pid_t=yes
ac_cv_type_size_t=yes
ac_cv_working_alloca_h=yes
am_cv_CCAS_dependencies_compiler_type=gcc3
am_cv_CC_dependencies_compiler_type=gcc3
am_cv_make_support_nested_variables=yes
am_cv_val_LC_MESSAGES=yes
br_cv_binreloc=no
gt_cv_func_dgettext_libc=yes
gt_cv_func_dgettext_libintl=no
gt_cv_func_ngettext_libc=yes
gt_cv_have_gettext=yes
lt_cv_ar_at_file=@
lt_cv_archive_cmds_need_lc=no
lt_cv_deplibs_check_method=pass_all
lt_cv_file_magic_cmd='$MAGIC_CMD'
lt_cv_file_magic_test_file=
lt_cv_ld_reload_flag=-r
lt_cv_nm_interface='BSD nm'
lt_cv_objdir=.libs
lt_cv_path_LD=/usr/x86_64-suse-linux/bin/ld
lt_cv_path_NM='/usr/bin/nm -B'
lt_cv_path_mainfest_tool=no
lt_cv_prog_compiler_c_o=yes
lt_cv_prog_compiler_pic='-fPIC -DPIC'
lt_cv_prog_compiler_pic_works=yes
lt_cv_prog_compiler_rtti_exceptions=no
lt_cv_prog_compiler_static_works=no
lt_cv_prog_gnu_ld=yes
lt_cv_sharedlib_from_linklib_cmd='printf %s\n'
lt_cv_shlibpath_overrides_runpath=yes
lt_cv_sys_global_symbol_pipe='sed -n -e '\''s/^.*[	 ]\([ABCDGIRSTW][ABCDGIRSTW]*\)[	 ][	 ]*\([_A-Za-z][_A-Za-z0-9]*\)$/\1 \2 \2/p'\'' | sed '\''/ __gnu_lto/d'\'''
ONE LAST TIME
 
Old 05-11-2012, 02:34 AM   #5
Knightron
Senior Member
 
Registered: Jan 2011
Location: Planet Earth
Distribution: Slackware.
Posts: 1,339
Blog Entries: 7

Original Poster
Rep: Reputation: 159Reputation: 159
Code:
lt_cv_sys_global_symbol_to_c_name_address='sed -n -e '\''s/^: \([^ ]*\)[ ]*$/  {\"\1\", (void *) 0},/p'\'' -e '\''s/^[ABCDGIRSTW]* \([^ ]*\) \([^ ]*\)$/  {"\2", (void *) \&\2},/p'\'''
lt_cv_sys_global_symbol_to_c_name_address_lib_prefix='sed -n -e '\''s/^: \([^ ]*\)[ ]*$/  {\"\1\", (void *) 0},/p'\'' -e '\''s/^[ABCDGIRSTW]* \([^ ]*\) \(lib[^ ]*\)$/  {"\2", (void *) \&\2},/p'\'' -e '\''s/^[ABCDGIRSTW]* \([^ ]*\) \([^ ]*\)$/  {"lib\2", (void *) \&\2},/p'\'''
lt_cv_sys_global_symbol_to_cdecl='sed -n -e '\''s/^T .* \(.*\)$/extern int \1();/p'\'' -e '\''s/^[ABCDGIRSTW]* .* \(.*\)$/extern char \1;/p'\'''
lt_cv_sys_max_cmd_len=1572864
lt_cv_to_host_file_cmd=func_convert_file_noop
lt_cv_to_tool_file_cmd=func_convert_file_noop
pkg_cv_ATK_CFLAGS='-pthread -I/usr/include/atk-1.0 -I/usr/include/glib-2.0 -I/usr/lib64/glib-2.0/include  '
pkg_cv_ATK_LIBS='-pthread -latk-1.0 -lgobject-2.0 -lgthread-2.0 -lrt -lglib-2.0  '
pkg_cv_BABL_CFLAGS='-I/usr/local/include/babl-0.1  '
pkg_cv_BABL_LIBS='-L/usr/local/lib64 -lbabl-0.1 -lm  '
pkg_cv_GEGL_CFLAGS='-pthread -I/usr/local/include/gegl-0.2 -I/usr/local/include/babl-0.1 -I/usr/include/glib-2.0 -I/usr/lib64/glib-2.0/include  '
pkg_cv_GEGL_LIBS='-Wl,--export-dynamic -pthread -L/usr/local/lib64 -lgegl-0.2 -lgio-2.0 -lbabl-0.1 -lm -lgobject-2.0 -lgmodule-2.0 -lgthread-2.0 -lrt -lglib-2.0  '
pkg_cv_GIO_CFLAGS='-pthread -I/usr/include/glib-2.0 -I/usr/lib64/glib-2.0/include  '
pkg_cv_GIO_LIBS='-pthread -lgio-2.0 -lgobject-2.0 -lgmodule-2.0 -lgthread-2.0 -lrt -lglib-2.0  '
pkg_cv_GMODULE_NO_EXPORT_CFLAGS='-pthread -I/usr/include/glib-2.0 -I/usr/lib64/glib-2.0/include  '
pkg_cv_GMODULE_NO_EXPORT_LIBS='-pthread -lgmodule-2.0 -lrt -lglib-2.0  '

## ----------------- ##
## Output variables. ##
## ----------------- ##

AA_LIBS=''
ACLOCAL='${SHELL} /home/klaye/data/build/gimp-2.8.0/missing --run aclocal-1.11'
ALLOCA=''
ALL_LINGUAS=''
ALSA_CFLAGS=''
ALSA_LIBS=''
ALTIVEC_EXTRA_CFLAGS=''
AMDEPBACKSLASH='\'
AMDEP_FALSE='#'
AMDEP_TRUE=''
AMTAR='$${TAR-tar}'
AM_BACKSLASH='\'
AM_DEFAULT_V='$(AM_DEFAULT_VERBOSITY)'
AM_DEFAULT_VERBOSITY='0'
AM_V='$(V)'
AR='ar'
AS='as'
ATK_CFLAGS='-pthread -I/usr/include/atk-1.0 -I/usr/include/glib-2.0 -I/usr/lib64/glib-2.0/include  '
ATK_LIBS='-pthread -latk-1.0 -lgobject-2.0 -lgthread-2.0 -lrt -lglib-2.0  '
AUTOCONF='${SHELL} /home/klaye/data/build/gimp-2.8.0/missing --run autoconf'
AUTOHEADER='${SHELL} /home/klaye/data/build/gimp-2.8.0/missing --run autoheader'
AUTOMAKE='${SHELL} /home/klaye/data/build/gimp-2.8.0/missing --run automake-1.11'
AWK='gawk'
BABL_CFLAGS='-I/usr/local/include/babl-0.1  '
BABL_LIBS='-L/usr/local/lib64 -lbabl-0.1 -lm  '
BINRELOC_CFLAGS=''
BINRELOC_LIBS=''
BUILD_JP2_FALSE=''
BUILD_JP2_TRUE=''
BUILD_JPEG_FALSE=''
BUILD_JPEG_TRUE=''
BUILD_PRINT_FALSE=''
BUILD_PRINT_TRUE=''
BUILD_PYTHON_FALSE=''
BUILD_PYTHON_TRUE=''
BUILD_SCRIPT_FU_FALSE=''
BUILD_SCRIPT_FU_TRUE=''
BUILD_XJT_FALSE=''
BUILD_XJT_TRUE=''
BZIP2_LIBS=''
CAIRO_CFLAGS=''
CAIRO_LIBS=''
CAIRO_PDF_CFLAGS=''
CAIRO_PDF_LIBS=''
CAIRO_REQUIRED_VERSION='1.10.2'
CATALOGS=''
CATOBJEXT='.gmo'
CC='gcc'
CCAS='gcc'
CCASDEPMODE='depmode=gcc3'
CCASFLAGS='-g -O2'
CCDEPMODE='depmode=gcc3'
CFLAGS='-g -O2 -Wall -Wdeclaration-after-statement -Wmissing-prototypes -Werror=missing-prototypes -Wstrict-prototypes -Wmissing-declarations -Winit-self -Wpointer-arith -Wold-style-definition -Wmissing-format-attribute -Wformat-security  -fno-common -fdiagnostics-show-option  '
CPP='gcc -E'
CPPFLAGS=''
CURL_CFLAGS=''
CURL_LIBS=''
CYGPATH_W='echo'
DATADIRNAME='share'
DBUS_BINDING_TOOL=''
DBUS_GLIB_CFLAGS=''
DBUS_GLIB_LIBS=''
DEFAULT_BINARY_FALSE=''
DEFAULT_BINARY_TRUE=''
DEFS=''
DEPDIR='.deps'
DESKTOP_DATADIR=''
DESKTOP_DATADIR_FALSE=''
DESKTOP_DATADIR_TRUE=''
DLLTOOL='false'
DOC_SHOOTER=''
DSYMUTIL=''
DUMPBIN=''
ECHO_C=''
ECHO_N='-n'
ECHO_T=''
EGREP='/usr/bin/grep -E'
ENABLE_GIMP_CONSOLE_FALSE=''
ENABLE_GIMP_CONSOLE_TRUE=''
ENABLE_GTK_DOC_APP_FALSE=''
ENABLE_GTK_DOC_APP_TRUE=''
ENABLE_GTK_DOC_FALSE=''
ENABLE_GTK_DOC_TRUE=''
EXEEXT=''
EXIF_CFLAGS=''
EXIF_LIBS=''
FGREP='/usr/bin/grep -F'
FILE_AA=''
FILE_JP2_LOAD=''
FILE_MNG=''
FILE_PDF_LOAD=''
FILE_PDF_SAVE=''
FILE_PNG=''
FILE_PS=''
FILE_PSP=''
FILE_SVG=''
FILE_TIFF_LOAD=''
FILE_TIFF_SAVE=''
FILE_WMF=''
FILE_XMC=''
FILE_XPM=''
FONTCONFIG_CFLAGS=''
FONTCONFIG_LIBS=''
FREETYPE_CONFIG=''
FREETYPE_LIBS=''
GDK_PIXBUF_CFLAGS=''
GDK_PIXBUF_CSOURCE=''
GDK_PIXBUF_LIBS=''
GDK_PIXBUF_REQUIRED_VERSION='2.24.1'
GEGL_CFLAGS='-pthread -I/usr/local/include/gegl-0.2 -I/usr/local/include/babl-0.1 -I/usr/include/glib-2.0 -I/usr/lib64/glib-2.0/include  '
GEGL_LIBS='-Wl,--export-dynamic -pthread -L/usr/local/lib64 -lgegl-0.2 -lgio-2.0 -lbabl-0.1 -lm -lgobject-2.0 -lgmodule-2.0 -lgthread-2.0 -lrt -lglib-2.0  '
GETTEXT_PACKAGE='gimp20'
GIMP_API_VERSION='2.0'
GIMP_APP_VERSION='2.8'
GIMP_BINARY_AGE='800'
GIMP_COMMAND=''
GIMP_DATA_VERSION='2.0'
GIMP_FULL_NAME='GNU Image Manipulation Program'
GIMP_INTERFACE_AGE='0'
GIMP_MAJOR_VERSION='2'
GIMP_MICRO_VERSION='0'
GIMP_MINOR_VERSION='8'
GIMP_MKENUMS=''
GIMP_MODULES=''
GIMP_PKGCONFIG_VERSION='2.0'
GIMP_PLUGINS=''
GIMP_PLUGIN_VERSION='2.0'
GIMP_REAL_VERSION='2.8.0'
GIMP_SYSCONF_VERSION='2.0'
GIMP_TOOL_VERSION='2.0'
GIMP_UNSTABLE='no'
GIMP_UNSTABLE_FALSE=''
GIMP_UNSTABLE_TRUE='#'
GIMP_USER_VERSION='2.8'
GIMP_VERSION='2.8.0'
GIO_CFLAGS='-pthread -I/usr/include/glib-2.0 -I/usr/lib64/glib-2.0/include  '
GIO_LIBS='-pthread -lgio-2.0 -lgobject-2.0 -lgmodule-2.0 -lgthread-2.0 -lrt -lglib-2.0  '
GLIB_CFLAGS='-pthread -I/usr/include/glib-2.0 -I/usr/lib64/glib-2.0/include  '
GLIB_COMPILE_RESOURCES=''
GLIB_GENMARSHAL='glib-genmarshal'
GLIB_LIBS='-pthread -lgobject-2.0 -lgthread-2.0 -lrt -lglib-2.0  '
GLIB_MKENUMS='glib-mkenums'
GLIB_REQUIRED_VERSION='2.30.2'
GMODULE_NO_EXPORT_CFLAGS='-pthread -I/usr/include/glib-2.0 -I/usr/lib64/glib-2.0/include  '
GMODULE_NO_EXPORT_LIBS='-pthread -lgmodule-2.0 -lrt -lglib-2.0  '
GMOFILES=''
GMSGFMT='/usr/bin/msgfmt'
GOBJECT_QUERY='gobject-query'
GREP='/usr/bin/grep'
GS_LIBS=''
GTKDOC_CHECK=''
GTKDOC_DEPS_CFLAGS=''
GTKDOC_DEPS_LIBS=''
GTKDOC_MKPDF=''
GTKDOC_REBASE=''
GTK_CFLAGS=''
GTK_DOC_BUILD_HTML_FALSE=''
GTK_DOC_BUILD_HTML_TRUE=''
GTK_DOC_BUILD_PDF_FALSE=''
GTK_DOC_BUILD_PDF_TRUE=''
GTK_DOC_USE_LIBTOOL_FALSE=''
GTK_DOC_USE_LIBTOOL_TRUE=''
GTK_DOC_USE_REBASE_FALSE=''
GTK_DOC_USE_REBASE_TRUE=''
GTK_LIBS=''
GTK_REQUIRED_VERSION='2.24.10'
GUDEV_CFLAGS=''
GUDEV_LIBS=''
HAVE_BZIP2_FALSE=''
HAVE_BZIP2_TRUE=''
HAVE_DX_DINPUT_FALSE=''
HAVE_DX_DINPUT_TRUE=''
HAVE_FINITE=''
HAVE_GS_FALSE=''
HAVE_GS_TRUE=''
HAVE_GVFS_FALSE=''
HAVE_GVFS_TRUE=''
HAVE_ISFINITE=''
HAVE_LCMS_FALSE=''
HAVE_LCMS_TRUE=''
HAVE_LIBCURL_FALSE=''
HAVE_LIBCURL_TRUE=''
HAVE_LIBEXIF_FALSE=''
HAVE_LIBEXIF_TRUE=''
HAVE_LINUX_INPUT_FALSE=''
HAVE_LINUX_INPUT_TRUE=''
HAVE_MAC_TWAIN_FALSE=''
HAVE_MAC_TWAIN_TRUE=''
HAVE_PNG_FALSE=''
HAVE_PNG_TRUE=''
HAVE_WEBKIT_FALSE=''
HAVE_WEBKIT_TRUE=''
HAVE_WINDRES_FALSE=''
HAVE_WINDRES_TRUE='#'
HAVE_XMLLINT_FALSE=''
HAVE_XMLLINT_TRUE=''
HAVE_XSLTPROC_FALSE=''
HAVE_XSLTPROC_TRUE=''
HAVE_XVFB_RUN_FALSE=''
HAVE_XVFB_RUN_TRUE=''
HAVE_Z_FALSE=''
HAVE_Z_TRUE=''
HTML_DIR=''
INSTALL_DATA='${INSTALL} -m 644'
INSTALL_PROGRAM='${INSTALL}'
INSTALL_SCRIPT='${INSTALL}'
INSTALL_STRIP_PROGRAM='$(install_sh) -c -s'
INSTOBJEXT='.mo'
INTLLIBS=''
INTLTOOL_CAVES_RULE='%.caves:     %.caves.in     $(INTLTOOL_MERGE) $(wildcard $(top_srcdir)/po/*.po) ; $(INTLTOOL_V_MERGE)LC_ALL=C $(INTLTOOL_MERGE) $(INTLTOOL_V_MERGE_OPTIONS) -d -u -c $(top_builddir)/po/.intltool-merge-cache $(top_srcdir)/po $< $@'
INTLTOOL_DESKTOP_RULE='%.desktop:   %.desktop.in   $(INTLTOOL_MERGE) $(wildcard $(top_srcdir)/po/*.po) ; $(INTLTOOL_V_MERGE)LC_ALL=C $(INTLTOOL_MERGE) $(INTLTOOL_V_MERGE_OPTIONS) -d -u -c $(top_builddir)/po/.intltool-merge-cache $(top_srcdir)/po $< $@'
INTLTOOL_DIRECTORY_RULE='%.directory: %.directory.in $(INTLTOOL_MERGE) $(wildcard $(top_srcdir)/po/*.po) ; $(INTLTOOL_V_MERGE)LC_ALL=C $(INTLTOOL_MERGE) $(INTLTOOL_V_MERGE_OPTIONS) -d -u -c $(top_builddir)/po/.intltool-merge-cache $(top_srcdir)/po $< $@'
INTLTOOL_EXTRACT='/usr/bin/intltool-extract'
INTLTOOL_KBD_RULE='%.kbd:       %.kbd.in       $(INTLTOOL_MERGE) $(wildcard $(top_srcdir)/po/*.po) ; $(INTLTOOL_V_MERGE)LC_ALL=C $(INTLTOOL_MERGE) $(INTLTOOL_V_MERGE_OPTIONS) -x -u -m -c $(top_builddir)/po/.intltool-merge-cache $(top_srcdir)/po $< $@'
INTLTOOL_KEYS_RULE='%.keys:      %.keys.in      $(INTLTOOL_MERGE) $(wildcard $(top_srcdir)/po/*.po) ; $(INTLTOOL_V_MERGE)LC_ALL=C $(INTLTOOL_MERGE) $(INTLTOOL_V_MERGE_OPTIONS) -k -u -c $(top_builddir)/po/.intltool-merge-cache $(top_srcdir)/po $< $@'
INTLTOOL_MERGE='/usr/bin/intltool-merge'
INTLTOOL_OAF_RULE='%.oaf:       %.oaf.in       $(INTLTOOL_MERGE) $(wildcard $(top_srcdir)/po/*.po) ; $(INTLTOOL_V_MERGE)LC_ALL=C $(INTLTOOL_MERGE) $(INTLTOOL_V_MERGE_OPTIONS) -o -p $(top_srcdir)/po $< $@'
INTLTOOL_PERL='/usr/bin/perl'
INTLTOOL_POLICY_RULE='%.policy:    %.policy.in    $(INTLTOOL_MERGE) $(wildcard $(top_srcdir)/po/*.po) ; $(INTLTOOL_V_MERGE)LC_ALL=C $(INTLTOOL_MERGE) $(INTLTOOL_V_MERGE_OPTIONS) -x -u -c $(top_builddir)/po/.intltool-merge-cache $(top_srcdir)/po $< $@'
INTLTOOL_PONG_RULE='%.pong:      %.pong.in      $(INTLTOOL_MERGE) $(wildcard $(top_srcdir)/po/*.po) ; $(INTLTOOL_V_MERGE)LC_ALL=C $(INTLTOOL_MERGE) $(INTLTOOL_V_MERGE_OPTIONS) -x -u -c $(top_builddir)/po/.intltool-merge-cache $(top_srcdir)/po $< $@'
INTLTOOL_PROP_RULE='%.prop:      %.prop.in      $(INTLTOOL_MERGE) $(wildcard $(top_srcdir)/po/*.po) ; $(INTLTOOL_V_MERGE)LC_ALL=C $(INTLTOOL_MERGE) $(INTLTOOL_V_MERGE_OPTIONS) -d -u -c $(top_builddir)/po/.intltool-merge-cache $(top_srcdir)/po $< $@'
INTLTOOL_SCHEMAS_RULE='%.schemas:   %.schemas.in   $(INTLTOOL_MERGE) $(wildcard $(top_srcdir)/po/*.po) ; $(INTLTOOL_V_MERGE)LC_ALL=C $(INTLTOOL_MERGE) $(INTLTOOL_V_MERGE_OPTIONS) -s -u -c $(top_builddir)/po/.intltool-merge-cache $(top_srcdir)/po $< $@'
INTLTOOL_SERVER_RULE='%.server:    %.server.in    $(INTLTOOL_MERGE) $(wildcard $(top_srcdir)/po/*.po) ; $(INTLTOOL_V_MERGE)LC_ALL=C $(INTLTOOL_MERGE) $(INTLTOOL_V_MERGE_OPTIONS) -o -u -c $(top_builddir)/po/.intltool-merge-cache $(top_srcdir)/po $< $@'
INTLTOOL_SERVICE_RULE='%.service: %.service.in   $(INTLTOOL_MERGE) $(wildcard $(top_srcdir)/po/*.po) ; $(INTLTOOL_V_MERGE)LC_ALL=C $(INTLTOOL_MERGE) $(INTLTOOL_V_MERGE_OPTIONS) -d -u -c $(top_builddir)/po/.intltool-merge-cache $(top_srcdir)/po $< $@'
INTLTOOL_SHEET_RULE='%.sheet:     %.sheet.in     $(INTLTOOL_MERGE) $(wildcard $(top_srcdir)/po/*.po) ; $(INTLTOOL_V_MERGE)LC_ALL=C $(INTLTOOL_MERGE) $(INTLTOOL_V_MERGE_OPTIONS) -x -u -c $(top_builddir)/po/.intltool-merge-cache $(top_srcdir)/po $< $@'
INTLTOOL_SOUNDLIST_RULE='%.soundlist: %.soundlist.in $(INTLTOOL_MERGE) $(wildcard $(top_srcdir)/po/*.po) ; $(INTLTOOL_V_MERGE)LC_ALL=C $(INTLTOOL_MERGE) $(INTLTOOL_V_MERGE_OPTIONS) -d -u -c $(top_builddir)/po/.intltool-merge-cache $(top_srcdir)/po $< $@'
INTLTOOL_THEME_RULE='%.theme:     %.theme.in     $(INTLTOOL_MERGE) $(wildcard $(top_srcdir)/po/*.po) ; $(INTLTOOL_V_MERGE)LC_ALL=C $(INTLTOOL_MERGE) $(INTLTOOL_V_MERGE_OPTIONS) -d -u -c $(top_builddir)/po/.intltool-merge-cache $(top_srcdir)/po $< $@'
INTLTOOL_UI_RULE='%.ui:        %.ui.in        $(INTLTOOL_MERGE) $(wildcard $(top_srcdir)/po/*.po) ; $(INTLTOOL_V_MERGE)LC_ALL=C $(INTLTOOL_MERGE) $(INTLTOOL_V_MERGE_OPTIONS) -x -u -c $(top_builddir)/po/.intltool-merge-cache $(top_srcdir)/po $< $@'
INTLTOOL_UPDATE='/usr/bin/intltool-update'
INTLTOOL_V_MERGE='$(INTLTOOL__v_MERGE_$(V))'
INTLTOOL_V_MERGE_OPTIONS='$(intltool__v_merge_options_$(V))'
INTLTOOL_XAM_RULE='%.xam:       %.xml.in       $(INTLTOOL_MERGE) $(wildcard $(top_srcdir)/po/*.po) ; $(INTLTOOL_V_MERGE)LC_ALL=C $(INTLTOOL_MERGE) $(INTLTOOL_V_MERGE_OPTIONS) -x -u -c $(top_builddir)/po/.intltool-merge-cache $(top_srcdir)/po $< $@'
INTLTOOL_XML_NOMERGE_RULE='%.xml:       %.xml.in       $(INTLTOOL_MERGE) ; $(INTLTOOL_V_MERGE)_it_tmp_dir=tmp.intltool.$$RANDOM && mkdir $$_it_tmp_dir && LC_ALL=C $(INTLTOOL_MERGE) $(INTLTOOL_V_MERGE_OPTIONS) -x -u $$_it_tmp_dir $< $@ && rmdir $$_it_tmp_dir'
INTLTOOL_XML_RULE='%.xml:       %.xml.in       $(INTLTOOL_MERGE) $(wildcard $(top_srcdir)/po/*.po) ; $(INTLTOOL_V_MERGE)LC_ALL=C $(INTLTOOL_MERGE) $(INTLTOOL_V_MERGE_OPTIONS) -x -u -c $(top_builddir)/po/.intltool-merge-cache $(top_srcdir)/po $< $@'
INTLTOOL__v_MERGE_0='@echo "  ITMRG " $@;'
INTLTOOL__v_MERGE_='$(INTLTOOL__v_MERGE_$(AM_DEFAULT_VERBOSITY))'
ISO_CODES_LOCALEDIR=''
ISO_CODES_LOCATION=''
JP2_LIBS=''
JPEG_LIBS=''
LCMS=''
LCMS_CFLAGS=''
LCMS_LIBS=''
LD='/usr/x86_64-suse-linux/bin/ld -m elf_x86_64'
LDFLAGS=''
LIBOBJS=''
LIBS=''
LIBTOOL='$(SHELL) $(top_builddir)/libtool'
LIPO=''
LN_S='ln -s'
LTLIBOBJS=''
LT_CURRENT_MINUS_AGE='0'
LT_VERSION_INFO='800:0:800'
MAIL=''
MAINT=''
MAINTAINER_MODE_FALSE='#'
MAINTAINER_MODE_TRUE=''
MAKEINFO='${SHELL} /home/klaye/data/build/gimp-2.8.0/missing --run makeinfo'
MANIFEST_TOOL=':'
MIME_TYPES=''
MKDIR_P='/bin/mkdir -p'
MKINSTALLDIRS='./mkinstalldirs'
MMX_EXTRA_CFLAGS=''
MNG_CFLAGS=''
MNG_LIBS=''
MSGFMT='/usr/bin/msgfmt'
MSGFMT_OPTS='-c'
MSGMERGE='/usr/bin/msgmerge'
MS_LIB_AVAILABLE_FALSE=''
MS_LIB_AVAILABLE_TRUE='#'
NM='/usr/bin/nm -B'
NMEDIT=''
OBJDUMP='objdump'
OBJEXT='o'
OS_UNIX_FALSE='#'
OS_UNIX_TRUE=''
OS_WIN32_FALSE=''
OS_WIN32_TRUE='#'
OTOOL64=''
OTOOL=''
PACKAGE='gimp'
PACKAGE_BUGREPORT='http://bugzilla.gnome.org/enter_bug.cgi?product=GIMP'
PACKAGE_NAME='GIMP'
PACKAGE_STRING='GIMP 2.8.0'
PACKAGE_TARNAME='gimp'
PACKAGE_URL=''
PACKAGE_VERSION='2.8.0'
PANGOCAIRO_CFLAGS=''
PANGOCAIRO_LIBS=''
PATHSEP=':'
PATH_SEPARATOR=':'
PERL=''
PKG_CONFIG='/usr/bin/pkg-config'
PKG_CONFIG_LIBDIR=''
PKG_CONFIG_PATH=''
PLATFORM_WIN32_FALSE=''
PLATFORM_WIN32_TRUE='#'
PNG_CFLAGS=''
PNG_LIBS=''
POFILES=''
POPPLER_CFLAGS=''
POPPLER_LIBS=''
POSUB='po'
PO_IN_DATADIR_FALSE=''
PO_IN_DATADIR_TRUE=''
PYBIN_PATH=''
PYGIMP_EXTRA_CFLAGS=''
PYGTK_CFLAGS=''
PYGTK_CODEGEN=''
PYGTK_DEFSDIR=''
PYGTK_LIBS=''
PYLINK_LIBS=''
PYTHON=''
PYTHON_EXEC_PREFIX=''
PYTHON_INCLUDES=''
PYTHON_PLATFORM=''
PYTHON_PREFIX=''
PYTHON_VERSION=''
RANLIB='ranlib'
RT_LIBS=''
SCREENSHOT=''
SCREENSHOT_LIBS=''
SED='/usr/bin/sed'
SENDMAIL=''
SET_MAKE=''
SHELL='/bin/sh'
SOCKET_LIBS=''
SSE_EXTRA_CFLAGS=''
STATICLIBS_FALSE=''
STATICLIBS_TRUE=''
STRIP='strip'
SVG_CFLAGS=''
SVG_LIBS=''
SYMPREFIX=''
TIFF_LIBS=''
USE_BINRELOC_FALSE=''
USE_BINRELOC_TRUE='#'
USE_NLS='yes'
VERSION='2.8.0'
WEBKIT_CFLAGS=''
WEBKIT_LIBS=''
WEB_PAGE=''
WIN32_LARGE_ADDRESS_AWARE=''
WINDRES=':'
WITH_PDBGEN_FALSE=''
WITH_PDBGEN_TRUE=''
WMF_CFLAGS=''
WMF_CONFIG=''
WMF_LIBS=''
XFIXES_CFLAGS=''
XFIXES_LIBS=''
XGETTEXT='/usr/bin/xgettext'
XMC_CFLAGS=''
XMC_LIBS=''
XMKMF=''
XMLLINT=''
XMU_LIBS=''
XPM_LIBS=''
XSLTPROC=''
XVFB_RUN=''
X_CFLAGS=''
X_EXTRA_LIBS=''
X_LIBS=''
X_PRE_LIBS=' -lSM -lICE'
Z_LIBS=''
ac_ct_AR='ar'
ac_ct_CC='gcc'
ac_ct_DUMPBIN=''
am__EXEEXT_FALSE=''
am__EXEEXT_TRUE=''
am__fastdepCCAS_FALSE='#'
am__fastdepCCAS_TRUE=''
am__fastdepCC_FALSE='#'
am__fastdepCC_TRUE=''
am__include='include'
am__isrc=''
am__leading_dot='.'
am__nodep='_no'
am__quote=''
am__tar='$${TAR-tar} chof - "$$tardir"'
am__untar='$${TAR-tar} xf -'
bindir='${exec_prefix}/bin'
build='x86_64-unknown-linux-gnu'
build_alias=''
build_cpu='x86_64'
build_os='linux-gnu'
build_vendor='unknown'
datadir='${datarootdir}'
datarootdir='${prefix}/share'
docdir='${datarootdir}/doc/${PACKAGE_TARNAME}'
dvidir='${docdir}'
exec_prefix='NONE'
gimpdatadir=''
gimpdir=''
gimplocaledir=''
gimpplugindir=''
gimpsysconfdir=''
host='x86_64-unknown-linux-gnu'
host_alias=''
host_cpu='x86_64'
host_os='linux-gnu'
host_vendor='unknown'
htmldir='${docdir}'
includedir='${prefix}/include'
infodir='${datarootdir}/info'
install_sh='${SHELL} /home/klaye/data/build/gimp-2.8.0/install-sh'
intltool__v_merge_options_0='-q'
intltool__v_merge_options_='$(intltool__v_merge_options_$(AM_DEFAULT_VERBOSITY))'
libdir='${exec_prefix}/lib64'
libexecdir='${exec_prefix}/lib'
localedir='${datarootdir}/locale'
localstatedir='${prefix}/var'
mandir='${datarootdir}/man'
mkdir_p='/bin/mkdir -p'
ms_librarian=''
oldincludedir='/usr/include'
pdfdir='${docdir}'
pkgpyexecdir=''
pkgpythondir=''
prefix='NONE'
program_transform_name='s,x,x,'
psdir='${docdir}'
pyexecdir=''
pythondir=''
sbindir='${exec_prefix}/sbin'
sharedstatedir='${prefix}/com'
sysconfdir='${prefix}/etc'
target_alias=''

## ----------- ##
## confdefs.h. ##
## ----------- ##

/* confdefs.h */
#define PACKAGE_NAME "GIMP"
#define PACKAGE_TARNAME "gimp"
#define PACKAGE_VERSION "2.8.0"
#define PACKAGE_STRING "GIMP 2.8.0"
#define PACKAGE_BUGREPORT "http://bugzilla.gnome.org/enter_bug.cgi?product=GIMP"
#define PACKAGE_URL ""
#define GETTEXT_PACKAGE "gimp20"
#define STDC_HEADERS 1
#define HAVE_SYS_TYPES_H 1
#define HAVE_SYS_STAT_H 1
#define HAVE_STDLIB_H 1
#define HAVE_STRING_H 1
#define HAVE_MEMORY_H 1
#define HAVE_STRINGS_H 1
#define HAVE_INTTYPES_H 1
#define HAVE_STDINT_H 1
#define HAVE_UNISTD_H 1
#define HAVE_DLFCN_H 1
#define LT_OBJDIR ".libs/"
#define ARCH_X86 1
#define ARCH_X86_64 1
#define STDC_HEADERS 1
#define HAVE_SYS_WAIT_H 1
#define TIME_WITH_SYS_TIME 1
#define HAVE_SYS_PARAM_H 1
#define HAVE_SYS_TIME_H 1
#define HAVE_SYS_TIMES_H 1
#define HAVE_SYS_WAIT_H 1
#define HAVE_UNISTD_H 1
#define HAVE_VPRINTF 1
#define HAVE_ALLOCA_H 1
#define HAVE_ALLOCA 1
#define HAVE_FSYNC 1
#define HAVE_DIFFTIME 1
#define HAVE_MMAP 1
#define HAVE__NL_MEASUREMENT_MEASUREMENT 1
#define HAVE_LOCALE_H 1
#define HAVE_LC_MESSAGES 1
#define HAVE_BIND_TEXTDOMAIN_CODESET 1
#define HAVE_GETTEXT 1
#define HAVE_DCGETTEXT 1
#define ENABLE_NLS 1
#define HAVE_BIND_TEXTDOMAIN_CODESET 1

configure: exit 1
Thanks for your patience and help.
 
Old 05-11-2012, 02:53 AM   #6
knudfl
LQ 5k Club
 
Registered: Jan 2008
Location: Copenhagen, DK
Distribution: pclos2014.08, Slack14.1 DebWheezy, +50+ other Linux OS, for test only.
Posts: 13,982

Rep: Reputation: 2610Reputation: 2610Reputation: 2610Reputation: 2610Reputation: 2610Reputation: 2610Reputation: 2610Reputation: 2610Reputation: 2610Reputation: 2610Reputation: 2610
Quote:
Perhaps you should add the directory containing `iso-codes.pc'
to the PKG_CONFIG_PATH environment variable
No package 'iso-codes' found
configure:15839: $? = 1
configure:15851: result: no (iso-codes package not found)
# zypper in iso-codes-devel

.
 
Old 05-11-2012, 05:47 AM   #7
Knightron
Senior Member
 
Registered: Jan 2011
Location: Planet Earth
Distribution: Slackware.
Posts: 1,339
Blog Entries: 7

Original Poster
Rep: Reputation: 159Reputation: 159
Hey mate, thanks for the quick reply. I tried what you said, restarted my system just in case it hadn't registered it, and then retried ./configure. It didn't work, it failed with the same error.
 
Old 05-11-2012, 11:41 AM   #8
knudfl
LQ 5k Club
 
Registered: Jan 2008
Location: Copenhagen, DK
Distribution: pclos2014.08, Slack14.1 DebWheezy, +50+ other Linux OS, for test only.
Posts: 13,982

Rep: Reputation: 2610Reputation: 2610Reputation: 2610Reputation: 2610Reputation: 2610Reputation: 2610Reputation: 2610Reputation: 2610Reputation: 2610Reputation: 2610Reputation: 2610
OK, then better use the "final" gimp-2.8.0 ( 2.8 rc2 is buggy (very buggy))..
ftp://ftp.gimp.org/pub/gimp/v2.8/gimp-2.8.0.tar.bz2

Suse 12.1, I used these ( Installed with "--prefix=/usr/" ) ...
babl-0.1.10.tar.bz2 gegl-0.2.0.tar.bz2 glib-2.30.2.tar.xz
gtk+-2.24.10.tar.xz gdk-pixbuf-2.24.1.tar.xz .

The one and only configure thing : The Suse 12.1 librsvg-devel is not recognized.
'make' : No issues.

When libgimp-2_0-0 libgimpui-2_0-0 ( version 2.6.11 ) are removed :
The new 2.8.0 will can be used.

.
 
Old 05-11-2012, 06:40 PM   #9
Knightron
Senior Member
 
Registered: Jan 2011
Location: Planet Earth
Distribution: Slackware.
Posts: 1,339
Blog Entries: 7

Original Poster
Rep: Reputation: 159Reputation: 159
Hello again knudfl. I just noticed that the gtk i'd installed from the factory repo was not working. I only have two gtk2 programs, firefox and gpodder, and they both refuse to open; so i'm currently in the process of downgrading all the packages i previously upgraded. I will try to compile gtk from source instead. I find the suse names for packages overly confusing however; before i compile, which gtk packages should i remove from my system?

Thankyou
 
Old 05-12-2012, 01:08 AM   #10
knudfl
LQ 5k Club
 
Registered: Jan 2008
Location: Copenhagen, DK
Distribution: pclos2014.08, Slack14.1 DebWheezy, +50+ other Linux OS, for test only.
Posts: 13,982

Rep: Reputation: 2610Reputation: 2610Reputation: 2610Reputation: 2610Reputation: 2610Reputation: 2610Reputation: 2610Reputation: 2610Reputation: 2610Reputation: 2610Reputation: 2610
Quote:
Before I compile, which gtk packages should I remove from my system ?
I didn't remove any glib gtk babl gegl gdk-pixbuf .
The new installs to /usr/ are just overwriting the current versions.

A more correct way would of course be to build rpm packages
for the new versions. May take some extra time.

Firefox and the old gimp 2.6.11 worked OK with the new versions
of glib gtk babl gegl gdk-pixbuf .
I tested only those two gtk applications before removing gimp-2.6.11.

.

Last edited by knudfl; 05-12-2012 at 09:21 AM.
 
  


Reply


Thread Tools Search this Thread
Search this Thread:

Advanced Search

Posting Rules
You may not post new threads
You may not post replies
You may not post attachments
You may not edit your posts

BB code is On
Smilies are On
[IMG] code is Off
HTML code is Off


Similar Threads
Thread Thread Starter Forum Replies Last Post
LXer: GIMP Painter And GIMP Paint Studio Transform GIMP Into The Ultimate Painting Tool LXer Syndicated Linux News 0 02-08-2011 05:40 PM
compiling the gimp Netsensei General 3 12-06-2005 02:27 AM
Problems compiling Gimp... mykrob Linux - Software 3 09-25-2005 04:43 PM
Problem with Gimp 2.0 [compiling] Tsukasa Linux - Software 0 04-12-2004 06:19 AM
Compiling Gimp-Print Mikx Linux - Software 0 07-09-2003 09:09 AM


All times are GMT -5. The time now is 02:17 PM.

Main Menu
My LQ
Write for LQ
LinuxQuestions.org is looking for people interested in writing Editorials, Articles, Reviews, and more. If you'd like to contribute content, let us know.
Main Menu
Syndicate
RSS1  Latest Threads
RSS1  LQ News
Twitter: @linuxquestions
identi.ca: @linuxquestions
Facebook: linuxquestions Google+: linuxquestions
Open Source Consulting | Domain Registration