LinuxQuestions.org
Visit Jeremy's Blog.
Go Back   LinuxQuestions.org > Forums > Linux Forums > Linux - Newbie
User Name
Password
Linux - Newbie This Linux forum is for members that are new to Linux.
Just starting out and have a question? If it is not in the man pages or the how-to's this is the place!

Notices


Reply
  Search this Thread
Old 02-09-2005, 04:51 PM   #1
bloodfulldesire
LQ Newbie
 
Registered: Feb 2005
Location: usa
Distribution: suse linux 9.2 pro
Posts: 29

Rep: Reputation: 15
scribus problems


checking build system type... i686-pc-linux-gnu
checking host system type... i686-pc-linux-gnu
checking target system type... i686-pc-linux-gnu
checking for a BSD-compatible install... /usr/bin/install -c
checking for -p flag to install... yes
checking whether build environment is sane... yes
checking for gawk... gawk
checking whether make sets $(MAKE)... yes
checking for libart2-config... ./configure: line 2106: error:: command not foundno
checking for style of include used by make... GNU
checking for gcc... gcc
checking for C compiler default output file name... a.out
checking whether the C compiler works... yes
checking whether we are cross compiling... no
checking for suffix of executables...
checking for suffix of object files... o
checking whether we are using the GNU C compiler... yes
checking whether gcc accepts -g... yes
checking for gcc option to accept ANSI C... none needed
checking dependency style of gcc... gcc3
checking whether byte ordering is bigendian... no
checking for freetype-config... /usr/bin/freetype-config
checking for FT_Get_First_Char in -lfreetype... yes
checking for FT_Get_Next_Char in -lfreetype... yes
checking for xml2-config... ./configure: line 3712: error:: command not found
no
checking for socket in -lsocket... no
checking for gethostbyaddr in -lnsl... yes
checking for cups-config... no
checking for _cmsChannelsOf in -llcms... no
checking how to run the C preprocessor... gcc -E
checking for egrep... grep -E
checking for ANSI C header files... yes
checking for sys/types.h... yes
checking for sys/stat.h... yes
checking for stdlib.h... yes
checking for string.h... yes
checking for memory.h... yes
checking for strings.h... yes
checking for inttypes.h... yes
checking for stdint.h... yes
checking for unistd.h... yes
checking lcms.h usability... no
checking lcms.h presence... no
checking for lcms.h... no
checking lcms/lcms.h usability... no
checking lcms/lcms.h presence... no
checking for lcms/lcms.h... no
checking for TIFFOpen in -ltiff... no
checking for dlopen in -lc... no
checking for gcc... (cached) gcc
checking whether we are using the GNU C compiler... (cached) yes
checking whether gcc accepts -g... (cached) yes
checking for gcc option to accept ANSI C... (cached) none needed
checking dependency style of gcc... (cached) gcc3
checking how to run the C preprocessor... gcc -E
checking for g++... no
checking for c++... no
checking for gpp... no
checking for aCC... no
checking for CC... no
checking for cxx... no
checking for cc++... no
checking for cl... no
checking for FCC... no
checking for KCC... no
checking for RCC... no
checking for xlC_r... no
checking for xlC... no
checking whether we are using the GNU C++ compiler... no
checking whether g++ accepts -g... no
checking dependency style of g++... none
checking whether g++ supports -Wmissing-format-attribute... no
checking whether gcc supports -Wmissing-format-attribute... yes
checking whether g++ supports -Wundef... no
checking whether g++ supports -Wno-long-long... no
checking whether g++ supports -Wnon-virtual-dtor... no
checking how to run the C++ preprocessor... /lib/cpp
checking whether g++ supports -O0... no
checking whether g++ supports -Wl,--no-undefined... no
not using lib directory suffix
checking for a sed that does not truncate output... /usr/bin/sed
checking for ld used by gcc... /usr/i586-suse-linux/bin/ld
checking if the linker (/usr/i586-suse-linux/bin/ld) is GNU ld... yes
checking for /usr/i586-suse-linux/bin/ld option to reload object files... -r
checking for BSD-compatible nm... /usr/bin/nm -B
checking whether ln -s works... yes
checking how to recognise dependent libraries... pass_all
checking dlfcn.h usability... yes
checking dlfcn.h presence... yes
checking for dlfcn.h... yes
checking for g77... no
checking for f77... no
checking for xlf... no
checking for frt... no
checking for pgf77... no
checking for fort77... no
checking for fl32... no
checking for af77... no
checking for f90... no
checking for xlf90... no
checking for pgf90... no
checking for epcf90... no
checking for f95... no
checking for fort... no
checking for xlf95... no
checking for ifc... no
checking for efc... no
checking for pgf95... no
checking for lf95... no
checking for gfortran... no
checking whether we are using the GNU Fortran 77 compiler... no
checking whether accepts -g... no
checking the maximum length of command line arguments... 32768
checking command to parse /usr/bin/nm -B output from gcc object... ok
checking for objdir... .libs
checking for ar... ar
checking for ranlib... ranlib
checking for strip... strip
checking if gcc static flag works... yes
checking if gcc supports -fno-rtti -fno-exceptions... no
checking for gcc option to produce PIC... -fPIC
checking if gcc PIC flag -fPIC works... yes
checking if gcc supports -c -o file.o... yes
checking whether the gcc linker (/usr/i586-suse-linux/bin/ld) supports shared libraries... yes
checking whether -lc should be explicitly linked in... no
checking dynamic linker characteristics... GNU/Linux ld.so
checking how to hardcode library paths into programs... immediate
checking whether stripping libraries is possible... yes
checking for shl_load... no
checking for shl_load in -ldld... no
checking for dlopen... no
checking for dlopen in -ldl... yes
checking whether a program can dlopen itself... yes
checking whether a statically linked program can dlopen itself... yes
checking if libtool supports shared libraries... yes
checking whether to build shared libraries... yes
checking whether to build static libraries... no
configure: creating libtool
appending configuration tag "CXX" to libtool
checking whether the g++ linker (/usr/i586-suse-linux/bin/ld) supports shared libraries... yes
libtool.m4: error: problem compiling CXX test program
checking for g++ option to produce PIC...
checking if g++ supports -c -o file.o... no
checking whether the g++ linker (/usr/i586-suse-linux/bin/ld) supports shared libraries... yes
checking dynamic linker characteristics... GNU/Linux ld.so
checking how to hardcode library paths into programs... immediate
checking whether stripping libraries is possible... yes
checking for shl_load... (cached) no
checking for shl_load in -ldld... (cached) no
checking for dlopen... (cached) no
checking for dlopen in -ldl... (cached) yes
checking whether a program can dlopen itself... (cached) yes
checking whether a statically linked program can dlopen itself... (cached) yes
appending configuration tag "F77" to libtool
checking for dlopen in -ldl... (cached) yes
checking for shl_unload in -ldld... no
checking for pthread_create in -lpthread... yes
checking for Python directory... /usr/local
checking for Python2.4... header no library no modules no
checking for Python2.3... header no library no modules /usr/lib/python2.3
checking for Python2.2... header no library no modules no
checking for Python2.1... header no library no modules no
checking for Python2.0... header no library no modules no
checking for Python1.5... header no library no modules no
checking cups/cups.h usability... no
checking cups/cups.h presence... no
checking for cups/cups.h... no
checking for strlcat... no
checking if strlcat needs custom prototype... yes - in libkdefakes
checking for strlcpy... no
checking if strlcpy needs custom prototype... yes - in libkdefakes
checking for main in -lutil... yes
checking for main in -lcompat... no
checking for crypt in -lcrypt... yes
checking for socklen_t... size_t
checking for dnet_ntoa in -ldnet... no
checking for dnet_ntoa in -ldnet_stub... no
checking for inet_ntoa... yes
checking for connect... yes
checking for remove... yes
checking for shmat... yes
checking for sys/types.h... (cached) yes
checking for stdint.h... (cached) yes
checking sys/bitypes.h usability... yes
checking sys/bitypes.h presence... yes
checking for sys/bitypes.h... yes
checking for poll in -lpoll... no
checking CoreAudio/CoreAudio.h usability... no
checking CoreAudio/CoreAudio.h presence... no
checking for CoreAudio/CoreAudio.h... no
checking if res_init needs -lresolv... yes
checking if res_init is available... yes
checking for killpg in -lucb... no
checking for int... yes
checking size of int... 4
checking for short... yes
checking size of short... 2
checking for long... yes
checking size of long... 4
checking for char *... yes
checking size of char *... 4
checking for dlopen in -ldl... (cached) yes
checking for shl_unload in -ldld... (cached) no
checking for size_t... yes
checking size of size_t... 4
checking for unsigned long... yes
checking size of unsigned long... 4
checking sizeof size_t == sizeof unsigned long... yes
checking crt_externs.h usability... no
checking crt_externs.h presence... no
checking for crt_externs.h... no
checking for _NSGetEnviron... no
checking for vsnprintf... yes
checking for snprintf... yes
checking for X... configure: error: Can't find X includes. Please check your installation and add the correct paths!

thats what it says when i hit ./configure how can i fix it so it can find x
 
Old 02-09-2005, 05:07 PM   #2
secesh
Senior Member
 
Registered: Sep 2004
Location: Savannah, GA
Distribution: Ubuntu, Gentoo, Mythbuntu, ClarkConnect
Posts: 1,154

Rep: Reputation: 47
well... it looks like you're missing a ton of dependencies... any chance of you reinstalling suse with a 'full' install?
 
Old 02-09-2005, 05:15 PM   #3
bloodfulldesire
LQ Newbie
 
Registered: Feb 2005
Location: usa
Distribution: suse linux 9.2 pro
Posts: 29

Original Poster
Rep: Reputation: 15
i did do a full install at least i belive i did
why what dependencies am i missing
 
Old 02-09-2005, 07:14 PM   #4
bloodfulldesire
LQ Newbie
 
Registered: Feb 2005
Location: usa
Distribution: suse linux 9.2 pro
Posts: 29

Original Poster
Rep: Reputation: 15
`/root/Desktop/downloads/scribus-1.2.1/scribus/doc/e n'
make[5]: Nothing to be done for `all-am'.
make[5]: Leaving directory `/root/Desktop/downloads/scribus-1.2.1/scribus/doc/en '
make[4]: Leaving directory `/root/Desktop/downloads/scribus-1.2.1/scribus/doc/en '
make[4]: Entering directory `/root/Desktop/downloads/scribus-1.2.1/scribus/doc'
make[4]: Nothing to be done for `all-am'.
make[4]: Leaving directory `/root/Desktop/downloads/scribus-1.2.1/scribus/doc'
make[3]: Leaving directory `/root/Desktop/downloads/scribus-1.2.1/scribus/doc'
Making all in manpages
make[3]: Entering directory `/root/Desktop/downloads/scribus-1.2.1/scribus/manpa ges'
make[3]: Nothing to be done for `all'.
make[3]: Leaving directory `/root/Desktop/downloads/scribus-1.2.1/scribus/manpag es'
make[3]: Entering directory `/root/Desktop/downloads/scribus-1.2.1/scribus'
if gcc -DHAVE_CONFIG_H -I. -I. -I.. -I/usr/include/freetype2 -I/usr/lib/qt3/inc lude -I/usr/X11R6/include -DDOCDIR=\"/usr/local/share/scribus/doc/\" -DICONDIR=\ "/usr/local/share/scribus/icons/\" -DSAMPLESDIR=\"/usr/local/share/scribus/sampl es/\" -DSCRIPTSDIR=\"/usr/local/share/scribus/scripts/\" -DTEMPLATEDIR=\"/usr/lo cal/share/scribus/templates/\" -DLIBDIR=\"/usr/local/lib/scribus/\" -DPLUGINDIR= \"/usr/local/lib/scribus/plugins/\" -DQT_THREAD_SUPPORT -D_REENTRANT -ansi -W -Wall -Wchar-subscripts -Wshadow -Wpointer-arith -Wmissing-prototypes -Wwrite-st rings -D_XOPEN_SOURCE=500 -D_BSD_SOURCE -O2 -g -O2 -Wformat-security -Wmissing- format-attribute -MT art_kmisc.o -MD -MP -MF ".deps/art_kmisc.Tpo" -c -o art_kmi sc.o art_kmisc.c; \
then mv -f ".deps/art_kmisc.Tpo" ".deps/art_kmisc.Po"; else rm -f ".deps/art_kmi sc.Tpo"; exit 1; fi
art_kmisc.c:1:35: libart_lgpl/art_vpath.h: No such file or directory
art_kmisc.c:2:35: libart_lgpl/art_bpath.h: No such file or directory
art_kmisc.c:3:34: libart_lgpl/art_misc.h: No such file or directory
art_kmisc.c:4:36: libart_lgpl/art_affine.h: No such file or directory
art_kmisc.c:5:43: libart_lgpl/art_svp_render_aa.h: No such file or directory
In file included from art_kmisc.c:8:
art_kmisc.h:23:34: libart_lgpl/art_misc.h: No such file or directory
art_kmisc.h:24:35: libart_lgpl/art_bpath.h: No such file or directory
art_kmisc.h:25:35: libart_lgpl/art_vpath.h: No such file or directory
art_kmisc.h:26:40: libart_lgpl/art_alphagamma.h: No such file or directory
art_kmisc.h:27:41: libart_lgpl/art_filterlevel.h: No such file or directory
art_kmisc.h:28:33: libart_lgpl/art_svp.h: No such file or directory
In file included from art_kmisc.c:8:
art_kmisc.h:36: error: parse error before '*' token
art_kmisc.h:43: error: parse error before '*' token
art_kmisc.h:43: warning: type defaults to `int' in declaration of `ArtBpath'
art_kmisc.h:43: error: parse error before '*' token
art_kmisc.h:43: warning: type defaults to `int' in declaration of `ksvg_art_bez_ path_to_vec'
art_kmisc.h:43: warning: data definition has no type or storage class
art_kmisc.h:49: error: parse error before '*' token
art_kmisc.h:57: warning: type defaults to `int' in declaration of `ArtSVP'
art_kmisc.h:57: error: parse error before '*' token
art_kmisc.c:44: error: parse error before '*' token
art_kmisc.c:50: warning: no previous prototype for `ksvg_art_vpath_render_bez'
art_kmisc.c: In function `ksvg_art_vpath_render_bez':
art_kmisc.c:86: error: `x3' undeclared (first use in this function)
art_kmisc.c:86: error: (Each undeclared identifier is reported only once
art_kmisc.c:86: error: for each function it appears in.)
art_kmisc.c:86: error: `x0' undeclared (first use in this function)
art_kmisc.c:87: error: `y3' undeclared (first use in this function)
art_kmisc.c:87: error: `y0' undeclared (first use in this function)
art_kmisc.c:107: error: `flatness' undeclared (first use in this function)
art_kmisc.c:108: error: `y1' undeclared (first use in this function)
art_kmisc.c:108: error: `x1' undeclared (first use in this function)
art_kmisc.c:112: error: `y2' undeclared (first use in this function)
art_kmisc.c:112: error: `x2' undeclared (first use in this function)
art_kmisc.c:132: warning: implicit declaration of function `art_vpath_add_point'
art_kmisc.c:132: error: `p_vpath' undeclared (first use in this function)
art_kmisc.c:132: error: `pn' undeclared (first use in this function)
art_kmisc.c:132: error: `pn_max' undeclared (first use in this function)
art_kmisc.c:133: error: `ART_LINETO' undeclared (first use in this function)
art_kmisc.c: At top level:
art_kmisc.c:173: error: parse error before '*' token
art_kmisc.c:174: warning: type defaults to `int' in declaration of `ArtBpath'
art_kmisc.c:174: error: parse error before '*' token
art_kmisc.c:175: warning: return type defaults to `int'
art_kmisc.c:175: warning: no previous prototype for `ksvg_art_bez_path_to_vec'
art_kmisc.c: In function `ksvg_art_bez_path_to_vec':
art_kmisc.c:176: error: `ArtVpath' undeclared (first use in this function)
art_kmisc.c:176: error: `vec' undeclared (first use in this function)
art_kmisc.c:183: warning: implicit declaration of function `art_new'
art_kmisc.c:204: warning: implicit declaration of function `art_expand'
art_kmisc.c:205: error: `bez' undeclared (first use in this function)
art_kmisc.c:207: error: `ART_MOVETO_OPEN' undeclared (first use in this function )
art_kmisc.c:208: error: `ART_MOVETO' undeclared (first use in this function)
art_kmisc.c:209: error: `ART_LINETO' undeclared (first use in this function)
art_kmisc.c:217: error: `ART_END' undeclared (first use in this function)
art_kmisc.c:224: error: `ArtPathcode' undeclared (first use in this function)
art_kmisc.c:224: error: parse error before numeric constant
art_kmisc.c:229: error: `ART_CURVETO' undeclared (first use in this function)
art_kmisc.c:241: error: `flatness' undeclared (first use in this function)
art_kmisc.c: At top level:
art_kmisc.c:387: error: parse error before '*' token
art_kmisc.c:394: warning: no previous prototype for `ksvg_art_rgb_affine'
art_kmisc.c: In function `ksvg_art_rgb_affine':
art_kmisc.c:400: error: `art_u8' undeclared (first use in this function)
art_kmisc.c:400: error: `dst_p' undeclared (first use in this function)
art_kmisc.c:400: error: `dst_linestart' undeclared (first use in this function)
art_kmisc.c:400: warning: left-hand operand of comma expression has no effect
art_kmisc.c:401: error: syntax error before '*' token
art_kmisc.c:402: error: `ArtPoint' undeclared (first use in this function)
art_kmisc.c:406: error: `dst' undeclared (first use in this function)
art_kmisc.c:407: warning: implicit declaration of function `art_affine_invert'
art_kmisc.c:407: error: `affine' undeclared (first use in this function)
art_kmisc.c:409: error: `alpha' undeclared (first use in this function)
art_kmisc.c:410: error: `y0' undeclared (first use in this function)
art_kmisc.c:410: error: `y1' undeclared (first use in this function)
art_kmisc.c:412: error: `pt' undeclared (first use in this function)
art_kmisc.c:413: error: `x0' undeclared (first use in this function)
art_kmisc.c:414: error: `x1' undeclared (first use in this function)
art_kmisc.c:415: error: `src_width' undeclared (first use in this function)
art_kmisc.c:415: error: `src_height' undeclared (first use in this function)
art_kmisc.c:421: warning: implicit declaration of function `art_affine_point'
art_kmisc.c:421: error: `src_pt' undeclared (first use in this function)
art_kmisc.c:424: error: `src_p' undeclared (first use in this function)
art_kmisc.c:424: error: `src' undeclared (first use in this function)
art_kmisc.c:424: error: `src_rowstride' undeclared (first use in this function)
art_kmisc.c:436: error: `dst_rowstride' undeclared (first use in this function)
art_kmisc.c: At top level:
art_kmisc.c:471: error: parse error before "art_u8"
art_kmisc.c:471: warning: no semicolon at end of struct or union
art_kmisc.c:472: warning: type defaults to `int' in declaration of `dst'
art_kmisc.c:472: error: `dst' used prior to declaration
art_kmisc.c:472: warning: data definition has no type or storage class
art_kmisc.c:473: error: `dst_rowstride' used prior to declaration
art_kmisc.c:474: error: `x0' used prior to declaration
art_kmisc.c:474: error: `x1' used prior to declaration
art_kmisc.c:476: error: parse error before '*' token
art_kmisc.c:476: warning: type defaults to `int' in declaration of `src'
art_kmisc.c:476: error: `src' used prior to declaration
art_kmisc.c:476: warning: data definition has no type or storage class
art_kmisc.c:477: error: `src_width' used prior to declaration
art_kmisc.c:478: error: `src_height' used prior to declaration
art_kmisc.c:479: error: `src_rowstride' used prior to declaration
art_kmisc.c:480: error: parse error before '*' token
art_kmisc.c:480: warning: type defaults to `int' in declaration of `mask'
art_kmisc.c:480: warning: data definition has no type or storage class
art_kmisc.c:481: error: `y0' used prior to declaration
art_kmisc.c:482: error: parse error before '}' token
art_kmisc.c:485: error: parse error before '*' token
art_kmisc.c: In function `ksvg_art_rgb_affine_clip_run':
art_kmisc.c:488: error: syntax error before '*' token
art_kmisc.c:489: error: `ArtPoint' undeclared (first use in this function)
art_kmisc.c:493: error: `alpha' undeclared (first use in this function)
art_kmisc.c:496: error: `pt' undeclared (first use in this function)
art_kmisc.c:496: error: `y' undeclared (first use in this function)
art_kmisc.c:502: error: `src_pt' undeclared (first use in this function)
art_kmisc.c:514: error: `src_p' undeclared (first use in this function)
art_kmisc.c:519: error: `dst_p' undeclared (first use in this function)
art_kmisc.c: At top level:
art_kmisc.c:550: error: parse error before "ArtSVPRenderAAStep"
art_kmisc.c: In function `ksvg_art_rgb_affine_clip_callback':
art_kmisc.c:552: error: `callback_data' undeclared (first use in this function)
art_kmisc.c:553: error: `art_u8' undeclared (first use in this function)
art_kmisc.c:553: error: `linebuf' undeclared (first use in this function)
art_kmisc.c:555: error: `art_u32' undeclared (first use in this function)
art_kmisc.c:555: error: parse error before "running_sum"
art_kmisc.c:556: warning: declaration of `x0' shadows a global declaration
art_kmisc.c:474: warning: shadowed declaration is here
art_kmisc.c:556: warning: declaration of `x1' shadows a global declaration
art_kmisc.c:474: warning: shadowed declaration is here
art_kmisc.c:561: error: dereferencing pointer to incomplete type
art_kmisc.c:562: error: dereferencing pointer to incomplete type
art_kmisc.c:563: error: dereferencing pointer to incomplete type
art_kmisc.c:565: error: dereferencing pointer to incomplete type
art_kmisc.c:567: error: `n_steps' undeclared (first use in this function)
art_kmisc.c:569: error: `steps' undeclared (first use in this function)
art_kmisc.c:572: error: `running_sum' undeclared (first use in this function)
art_kmisc.c:574: error: `y' undeclared (first use in this function)
art_kmisc.c:574: error: dereferencing pointer to incomplete type
art_kmisc.c:574: error: dereferencing pointer to incomplete type
art_kmisc.c:574: error: dereferencing pointer to incomplete type
art_kmisc.c:574: error: dereferencing pointer to incomplete type
art_kmisc.c:574: error: dereferencing pointer to incomplete type
art_kmisc.c:586: error: dereferencing pointer to incomplete type
art_kmisc.c:586: error: dereferencing pointer to incomplete type
art_kmisc.c:586: error: dereferencing pointer to incomplete type
art_kmisc.c:586: error: dereferencing pointer to incomplete type
art_kmisc.c:586: error: dereferencing pointer to incomplete type
art_kmisc.c:594: error: dereferencing pointer to incomplete type
art_kmisc.c:594: error: dereferencing pointer to incomplete type
art_kmisc.c:594: error: dereferencing pointer to incomplete type
art_kmisc.c:594: error: dereferencing pointer to incomplete type
art_kmisc.c:594: error: dereferencing pointer to incomplete type
art_kmisc.c:601: error: dereferencing pointer to incomplete type
art_kmisc.c:601: error: dereferencing pointer to incomplete type
art_kmisc.c:601: error: dereferencing pointer to incomplete type
art_kmisc.c:601: error: dereferencing pointer to incomplete type
art_kmisc.c:601: error: dereferencing pointer to incomplete type
art_kmisc.c:604: error: dereferencing pointer to incomplete type
art_kmisc.c:604: error: dereferencing pointer to incomplete type
art_kmisc.c: At top level:
art_kmisc.c:608: error: parse error before '*' token
art_kmisc.c: In function `ksvg_art_rgb_affine_clip_mask_run':
art_kmisc.c:611: error: syntax error before '*' token
art_kmisc.c:612: error: `ArtPoint' undeclared (first use in this function)
art_kmisc.c:616: error: `alpha' undeclared (first use in this function)
art_kmisc.c:619: error: `pt' undeclared (first use in this function)
art_kmisc.c:619: error: `y' undeclared (first use in this function)
art_kmisc.c:625: error: `src_pt' undeclared (first use in this function)
art_kmisc.c:637: error: `src_p' undeclared (first use in this function)
art_kmisc.c:645: error: `dst_p' undeclared (first use in this function)
art_kmisc.c: At top level:
art_kmisc.c:679: error: parse error before "ArtSVPRenderAAStep"
art_kmisc.c: In function `ksvg_art_rgb_affine_clip_mask_callback':
art_kmisc.c:681: error: `callback_data' undeclared (first use in this function)
art_kmisc.c:682: error: `art_u8' undeclared (first use in this function)
art_kmisc.c:682: error: `linebuf' undeclared (first use in this function)
art_kmisc.c:684: error: `art_u32' undeclared (first use in this function)
art_kmisc.c:684: error: parse error before "running_sum"
art_kmisc.c:685: warning: declaration of `x0' shadows a global declaration
art_kmisc.c:474: warning: shadowed declaration is here
art_kmisc.c:685: warning: declaration of `x1' shadows a global declaration
art_kmisc.c:474: warning: shadowed declaration is here
art_kmisc.c:689: error: syntax error before '*' token
art_kmisc.c:691: error: dereferencing pointer to incomplete type
art_kmisc.c:692: error: dereferencing pointer to incomplete type
art_kmisc.c:693: error: dereferencing pointer to incomplete type
art_kmisc.c:695: error: dereferencing pointer to incomplete type
art_kmisc.c:696: error: `maskbuf' undeclared (first use in this function)
art_kmisc.c:696: error: dereferencing pointer to incomplete type
art_kmisc.c:696: error: `y' undeclared (first use in this function)
art_kmisc.c:696: error: dereferencing pointer to incomplete type
art_kmisc.c:698: error: `n_steps' undeclared (first use in this function)
art_kmisc.c:700: error: `steps' undeclared (first use in this function)
art_kmisc.c:703: error: `running_sum' undeclared (first use in this function)
art_kmisc.c:705: error: dereferencing pointer to incomplete type
art_kmisc.c:705: error: dereferencing pointer to incomplete type
art_kmisc.c:705: error: dereferencing pointer to incomplete type
art_kmisc.c:705: error: dereferencing pointer to incomplete type
art_kmisc.c:705: error: dereferencing pointer to incomplete type
art_kmisc.c:717: error: dereferencing pointer to incomplete type
art_kmisc.c:717: error: dereferencing pointer to incomplete type
art_kmisc.c:717: error: dereferencing pointer to incomplete type
art_kmisc.c:717: error: dereferencing pointer to incomplete type
art_kmisc.c:717: error: dereferencing pointer to incomplete type
art_kmisc.c:725: error: dereferencing pointer to incomplete type
art_kmisc.c:725: error: dereferencing pointer to incomplete type
art_kmisc.c:725: error: dereferencing pointer to incomplete type
art_kmisc.c:725: error: dereferencing pointer to incomplete type
art_kmisc.c:725: error: dereferencing pointer to incomplete type
art_kmisc.c:732: error: dereferencing pointer to incomplete type
art_kmisc.c:732: error: dereferencing pointer to incomplete type
art_kmisc.c:732: error: dereferencing pointer to incomplete type
art_kmisc.c:732: error: dereferencing pointer to incomplete type
art_kmisc.c:732: error: dereferencing pointer to incomplete type
art_kmisc.c:735: error: dereferencing pointer to incomplete type
art_kmisc.c:735: error: dereferencing pointer to incomplete type
art_kmisc.c: At top level:
art_kmisc.c:739: error: parse error before '*' token
art_kmisc.c: In function `ksvg_art_rgba_affine_clip_run':
art_kmisc.c:742: error: syntax error before '*' token
art_kmisc.c:743: error: `ArtPoint' undeclared (first use in this function)
art_kmisc.c:747: error: `alpha' undeclared (first use in this function)
art_kmisc.c:750: error: `pt' undeclared (first use in this function)
art_kmisc.c:750: error: `y' undeclared (first use in this function)
art_kmisc.c:756: error: `src_pt' undeclared (first use in this function)
art_kmisc.c:768: error: `src_p' undeclared (first use in this function)
art_kmisc.c:777: error: `dst_p' undeclared (first use in this function)
art_kmisc.c: At top level:
art_kmisc.c:825: error: parse error before "ArtSVPRenderAAStep"
art_kmisc.c: In function `ksvg_art_rgba_affine_clip_callback':
art_kmisc.c:827: error: `callback_data' undeclared (first use in this function)
art_kmisc.c:828: error: `art_u8' undeclared (first use in this function)
art_kmisc.c:828: error: `linebuf' undeclared (first use in this function)
art_kmisc.c:830: error: `art_u32' undeclared (first use in this function)
art_kmisc.c:830: error: parse error before "running_sum"
art_kmisc.c:831: warning: declaration of `x0' shadows a global declaration
art_kmisc.c:474: warning: shadowed declaration is here
art_kmisc.c:831: warning: declaration of `x1' shadows a global declaration
art_kmisc.c:474: warning: shadowed declaration is here
art_kmisc.c:836: error: dereferencing pointer to incomplete type
art_kmisc.c:837: error: dereferencing pointer to incomplete type
art_kmisc.c:838: error: dereferencing pointer to incomplete type
art_kmisc.c:840: error: dereferencing pointer to incomplete type
art_kmisc.c:842: error: `n_steps' undeclared (first use in this function)
art_kmisc.c:844: error: `steps' undeclared (first use in this function)
art_kmisc.c:847: error: `running_sum' undeclared (first use in this function)
art_kmisc.c:849: error: `y' undeclared (first use in this function)
art_kmisc.c:849: error: dereferencing pointer to incomplete type
art_kmisc.c:849: error: dereferencing pointer to incomplete type
art_kmisc.c:849: error: dereferencing pointer to incomplete type
art_kmisc.c:849: error: dereferencing pointer to incomplete type
art_kmisc.c:849: error: dereferencing pointer to incomplete type
art_kmisc.c:861: error: dereferencing pointer to incomplete type
art_kmisc.c:861: error: dereferencing pointer to incomplete type
art_kmisc.c:861: error: dereferencing pointer to incomplete type
art_kmisc.c:861: error: dereferencing pointer to incomplete type
art_kmisc.c:861: error: dereferencing pointer to incomplete type
art_kmisc.c:869: error: dereferencing pointer to incomplete type
art_kmisc.c:869: error: dereferencing pointer to incomplete type
art_kmisc.c:869: error: dereferencing pointer to incomplete type
art_kmisc.c:869: error: dereferencing pointer to incomplete type
art_kmisc.c:869: error: dereferencing pointer to incomplete type
art_kmisc.c:876: error: dereferencing pointer to incomplete type
art_kmisc.c:876: error: dereferencing pointer to incomplete type
art_kmisc.c:876: error: dereferencing pointer to incomplete type
art_kmisc.c:876: error: dereferencing pointer to incomplete type
art_kmisc.c:876: error: dereferencing pointer to incomplete type
art_kmisc.c:879: error: dereferencing pointer to incomplete type
art_kmisc.c:879: error: dereferencing pointer to incomplete type
art_kmisc.c: At top level:
art_kmisc.c:883: error: parse error before '*' token
art_kmisc.c: In function `ksvg_art_rgba_affine_clip_mask_run':
art_kmisc.c:886: error: syntax error before '*' token
art_kmisc.c:887: error: `ArtPoint' undeclared (first use in this function)
art_kmisc.c:891: error: `alpha' undeclared (first use in this function)
art_kmisc.c:894: error: `pt' undeclared (first use in this function)
art_kmisc.c:894: error: `y' undeclared (first use in this function)
art_kmisc.c:900: error: `src_pt' undeclared (first use in this function)
art_kmisc.c:912: error: `src_p' undeclared (first use in this function)
art_kmisc.c:920: error: `dst_p' undeclared (first use in this function)
art_kmisc.c: At top level:
art_kmisc.c:961: error: parse error before "ArtSVPRenderAAStep"
art_kmisc.c: In function `ksvg_art_rgba_affine_clip_mask_callback':
art_kmisc.c:963: error: `callback_data' undeclared (first use in this function)
art_kmisc.c:964: error: `art_u8' undeclared (first use in this function)
art_kmisc.c:964: error: `linebuf' undeclared (first use in this function)
art_kmisc.c:966: error: `art_u32' undeclared (first use in this function)
art_kmisc.c:966: error: parse error before "running_sum"
art_kmisc.c:967: warning: declaration of `x0' shadows a global declaration
art_kmisc.c:474: warning: shadowed declaration is here
art_kmisc.c:967: warning: declaration of `x1' shadows a global declaration
art_kmisc.c:474: warning: shadowed declaration is here
art_kmisc.c:971: error: syntax error before '*' token
art_kmisc.c:973: error: dereferencing pointer to incomplete type
art_kmisc.c:974: error: dereferencing pointer to incomplete type
art_kmisc.c:975: error: dereferencing pointer to incomplete type
art_kmisc.c:977: error: dereferencing pointer to incomplete type
art_kmisc.c:978: error: `maskbuf' undeclared (first use in this function)
art_kmisc.c:978: error: dereferencing pointer to incomplete type
art_kmisc.c:978: error: `y' undeclared (first use in this function)
art_kmisc.c:978: error: dereferencing pointer to incomplete type
art_kmisc.c:980: error: `n_steps' undeclared (first use in this function)
art_kmisc.c:982: error: `steps' undeclared (first use in this function)
art_kmisc.c:985: error: `running_sum' undeclared (first use in this function)
art_kmisc.c:987: error: dereferencing pointer to incomplete type
art_kmisc.c:987: error: dereferencing pointer to incomplete type
art_kmisc.c:987: error: dereferencing pointer to incomplete type
art_kmisc.c:987: error: dereferencing pointer to incomplete type
art_kmisc.c:987: error: dereferencing pointer to incomplete type
art_kmisc.c:999: error: dereferencing pointer to incomplete type
art_kmisc.c:999: error: dereferencing pointer to incomplete type
art_kmisc.c:999: error: dereferencing pointer to incomplete type
art_kmisc.c:999: error: dereferencing pointer to incomplete type
art_kmisc.c:999: error: dereferencing pointer to incomplete type
art_kmisc.c:1007: error: dereferencing pointer to incomplete type
art_kmisc.c:1007: error: dereferencing pointer to incomplete type
art_kmisc.c:1007: error: dereferencing pointer to incomplete type
art_kmisc.c:1007: error: dereferencing pointer to incomplete type
art_kmisc.c:1007: error: dereferencing pointer to incomplete type
art_kmisc.c:1014: error: dereferencing pointer to incomplete type
art_kmisc.c:1014: error: dereferencing pointer to incomplete type
art_kmisc.c:1014: error: dereferencing pointer to incomplete type
art_kmisc.c:1014: error: dereferencing pointer to incomplete type
art_kmisc.c:1014: error: dereferencing pointer to incomplete type
art_kmisc.c:1017: error: dereferencing pointer to incomplete type
art_kmisc.c:1017: error: dereferencing pointer to incomplete type
art_kmisc.c: At top level:
art_kmisc.c:1056: warning: type defaults to `int' in declaration of `ArtSVP'
art_kmisc.c:1056: error: parse error before '*' token
art_kmisc.c:1061: warning: no previous prototype for `ksvg_art_rgb_affine_clip'
art_kmisc.c: In function `ksvg_art_rgb_affine_clip':
art_kmisc.c:1062: error: storage size of `data' isn't known
art_kmisc.c:1066: error: `alpha' undeclared (first use in this function)
art_kmisc.c:1084: error: `affine' undeclared (first use in this function)
art_kmisc.c:1091: error: `dst_channels' undeclared (first use in this function)
art_kmisc.c:1094: warning: implicit declaration of function `art_svp_render_aa'
art_kmisc.c:1094: error: `svp' undeclared (first use in this function)
art_kmisc.c:1094: error: `y1' undeclared (first use in this function)
art_kmisc.c:1062: warning: unused variable `data'
make[3]: *** [art_kmisc.o] Error 1
make[3]: Leaving directory `/root/Desktop/downloads/scribus-1.2.1/scribus'
make[2]: *** [all-recursive] Error 1
make[2]: Leaving directory `/root/Desktop/downloads/scribus-1.2.1/scribus'
make[1]: *** [all-recursive] Error 1
make[1]: Leaving directory `/root/Desktop/downloads/scribus-1.2.1'
make: *** [all] Errorthis is when i did make after i hit ./configure ( finally go to configure it but now it ownt let me make the file any one know how to solve this plz help me
 
  


Reply


Thread Tools Search this Thread
Search this Thread:

Advanced Search

Posting Rules
You may not post new threads
You may not post replies
You may not post attachments
You may not edit your posts

BB code is On
Smilies are On
[IMG] code is Off
HTML code is Off



Similar Threads
Thread Thread Starter Forum Replies Last Post
Scribus help mifan Linux - Software 1 08-26-2005 08:03 PM
getting started in Scribus blotch Linux - Software 7 08-22-2005 11:18 AM
O.O. and Scribus Interceptor Linux - Software 1 12-31-2004 05:03 PM
Comment on Scribus satimis Linux - Software 2 04-07-2004 09:47 AM
Scribus help trihai44100 Linux - Software 0 03-12-2004 10:23 PM


All times are GMT -5. The time now is 12:41 PM.

Main Menu
Advertisement
My LQ
Write for LQ
LinuxQuestions.org is looking for people interested in writing Editorials, Articles, Reviews, and more. If you'd like to contribute content, let us know.
Main Menu
Syndicate
RSS1  Latest Threads
RSS1  LQ News
Twitter: @linuxquestions
Facebook: linuxquestions Google+: linuxquestions
Open Source Consulting | Domain Registration