LinuxQuestions.org
Latest LQ Deal: Complete CCNA, CCNP & Red Hat Certification Training Bundle
Go Back   LinuxQuestions.org > Forums > Linux Forums > Linux - Newbie
User Name
Password
Linux - Newbie This Linux forum is for members that are new to Linux.
Just starting out and have a question? If it is not in the man pages or the how-to's this is the place!

Notices


Reply
  Search this Thread
Old 09-03-2004, 08:34 AM   #1
sevi
Member
 
Registered: Aug 2004
Location: Hungary
Distribution: Mandriva 2006.0 Free
Posts: 33

Rep: Reputation: 15
Angry qtparted compile error


I'm usind FC2, and I configured qtparted with --disable-ntfs, --disable-xfs --disable-reiserfs options.

When I try to make qtparted, i get the following output:

Code:
make  all-recursive
make[1]: Entering directory `/home/sevcsik/Desktop/qtparted-0.4.4'
Making all in src
make[2]: Entering directory `/home/sevcsik/Desktop/qtparted-0.4.4/src'
make[3]: Entering directory `/home/sevcsik/Desktop/qtparted-0.4.4/src'
/usr/lib/qt-3.3/bin/uic -L  -nounload -o qp_ui_config.h ./qp_ui_config.ui
Session management error: Authentication Rejected, reason : None of the authentication protocols specified are supported and host-based authentication failed
/usr/lib/qt-3.3/bin/uic -L  -nounload -o qp_ui_create.h ./qp_ui_create.ui
Session management error: Authentication Rejected, reason : None of the authentication protocols specified are supported and host-based authentication failed
/usr/lib/qt-3.3/bin/uic -L  -nounload -o qp_ui_format.h ./qp_ui_format.ui
Session management error: Authentication Rejected, reason : None of the authentication protocols specified are supported and host-based authentication failed
/usr/lib/qt-3.3/bin/uic -L  -nounload -o qp_ui_progress.h ./qp_ui_progress.ui
Session management error: Authentication Rejected, reason : None of the authentication protocols specified are supported and host-based authentication failed
/usr/lib/qt-3.3/bin/uic -L  -nounload -o qp_ui_resize.h ./qp_ui_resize.ui
Session management error: Authentication Rejected, reason : None of the authentication protocols specified are supported and host-based authentication failed
/usr/lib/qt-3.3/bin/uic -L  -nounload -o qp_ui_devprop.h ./qp_ui_devprop.ui
Session management error: Authentication Rejected, reason : None of the authentication protocols specified are supported and host-based authentication failed
if g++ -DHAVE_CONFIG_H -I. -I. -I.. -I. -I/usr/lib/qt-3.3/include -I-I/usr/lib/qt-3.3/include -I/usr/X11R6/include   -DQT_THREAD_SUPPORT  -D_REENTRANT -fexceptions  -Wall -Wno-deprecated  -Wnon-virtual-dtor -Wno-long-long -Wundef -Wall -pedantic -W -Wpointer-arith -Wwrite-strings -ansi -D_XOPEN_SOURCE=500 -D_BSD_SOURCE -Wcast-align -Wconversion -O2 -g -O2 -fno-exceptions -fno-check-new  -MT main.o -MD -MP -MF ".deps/main.Tpo" \
  -c -o main.o `test -f 'main.cpp' || echo './'`main.cpp; \
then mv -f ".deps/main.Tpo" ".deps/main.Po"; \
else rm -f ".deps/main.Tpo"; exit 1; \
fi
In file included from main.cpp:35:
qp_libparted.h:34:27: parted/parted.h: Nincs ilyen fjl vagy knyvtr
In file included from main.cpp:35:
qp_libparted.h:57: error: 'PedSector' is used as a type, but is not defined as
   a type.
qp_libparted.h:58: error: 'PedSector' is used as a type, but is not defined as
   a type.
qp_libparted.h:59: error: 'PedSector' is used as a type, but is not defined as
   a type.
qp_libparted.h:60: error: 'PedSector' is used as a type, but is not defined as
   a type.
qp_libparted.h:61: error: 'PedSector' is used as a type, but is not defined as
   a type.
qp_libparted.h:83: error: `PedSector' was not declared in this scope
qp_libparted.h:83: error: `PedSector' was not declared in this scope
qp_libparted.h:83: error: invalid data member initialization
qp_libparted.h:83: error: (use `=' to initialize static data members)
qp_libparted.h:85: error: `PedSector' was not declared in this scope
qp_libparted.h:85: error: `PedSector' was not declared in this scope
qp_libparted.h:85: error: invalid data member initialization
qp_libparted.h:106: error: 'PedGeometry' is used as a type, but is not defined
   as a type.
qp_libparted.h:145: error: `PedGeometry' was not declared in this scope
qp_libparted.h:145: error: `geom' was not declared in this scope
qp_libparted.h:145: error: `PedDisk' was not declared in this scope
qp_libparted.h:145: error: `disk' was not declared in this scope
qp_libparted.h:145: error: invalid data member initialization
qp_libparted.h:146: error: `PedSector' was not declared in this scope
qp_libparted.h:146: error: syntax error before `,' token
qp_libparted.h:147: error: `PedSector' was not declared in this scope
qp_libparted.h:147: error: syntax error before `,' token
qp_libparted.h:151: error: type specifier omitted for parameter `PedSector'
qp_libparted.h:151: error: syntax error before `,' token
qp_libparted.h:152: error: type specifier omitted for parameter `PedSector'
qp_libparted.h:152: error: type specifier omitted for parameter `PedSector'
qp_libparted.h:159: error: type specifier omitted for parameter `PedSector'
qp_libparted.h:159: error: type specifier omitted for parameter `PedSector'
qp_libparted.h:160: error: type specifier omitted for parameter `PedSector'
qp_libparted.h:160: error: type specifier omitted for parameter `PedSector'
qp_libparted.h:161: error: type specifier omitted for parameter `PedSector'
qp_libparted.h:161: error: type specifier omitted for parameter `PedSector'
qp_libparted.h:162: error: type specifier omitted for parameter `PedSector'
qp_libparted.h:162: error: type specifier omitted for parameter `PedSector'
qp_libparted.h:163: error: syntax error before `*' token
qp_libparted.h:164: error: type specifier omitted for parameter `PedSector'
qp_libparted.h:164: error: type specifier omitted for parameter `PedSector'
qp_libparted.h:174: error: type specifier omitted for parameter `PedSector'
qp_libparted.h:174: error: type specifier omitted for parameter `PedSector'
qp_libparted.h:175: error: syntax error before `)' token
qp_libparted.h:176: error: `PedPartition' was not declared in this scope
qp_libparted.h:176: error: syntax error before `)' token
qp_libparted.h:177: error: `PedDisk' was not declared in this scope
qp_libparted.h:177: error: syntax error before `)' token
qp_libparted.h:178: error: syntax error before `*' token
In file included from qp_window.h:40,
                 from main.cpp:37:
qp_dlgcreate.h:46: error: `PedSector' was not declared in this scope
qp_dlgcreate.h:46: error: syntax error before `)' token
qp_dlgcreate.h:51: error: syntax error before `)' token
qp_dlgcreate.h:57: error: 'PedSector' is used as a type, but is not defined as
   a type.
qp_dlgcreate.h:67: error: `PedSector' was not declared in this scope
qp_dlgcreate.h:67: error: invalid data member initialization
qp_dlgcreate.h:67: error: variable or field `slotSizeChanged' declared void
In file included from qp_dlgresize.h:34,
                 from qp_window.h:42,
                 from main.cpp:37:
qp_sizepart.h:47: error: `PedSector' was not declared in this scope
qp_sizepart.h:47: error: invalid data member initialization
qp_sizepart.h:47: error: variable or field `setMaxPartSector' declared void
qp_sizepart.h:48: error: `PedSector' was not declared in this scope
qp_sizepart.h:48: error: invalid data member initialization
qp_sizepart.h:48: error: variable or field `setMinPartSector' declared void
qp_sizepart.h:49: error: `PedSector' was not declared in this scope
qp_sizepart.h:49: error: invalid data member initialization
qp_sizepart.h:49: error: variable or field `setStartPartSector' declared void
qp_sizepart.h:50: error: `PedSector' was not declared in this scope
qp_sizepart.h:50: error: invalid data member initialization
qp_sizepart.h:50: error: variable or field `setEndPartSector' declared void
qp_sizepart.h:51: error: `PedSector' was not declared in this scope
qp_sizepart.h:51: error: invalid data member initialization
qp_sizepart.h:51: error: variable or field `setGrowStartPartSector' declared
   void
qp_sizepart.h:52: error: `PedSector' was not declared in this scope
qp_sizepart.h:52: error: invalid data member initialization
qp_sizepart.h:52: error: variable or field `setGrowEndPartSector' declared void
qp_sizepart.h:62: error: 'PedSector' is used as a type, but is not defined as a
   type.
qp_sizepart.h:63: error: 'PedSector' is used as a type, but is not defined as a
   type.
qp_sizepart.h:64: error: 'PedSector' is used as a type, but is not defined as a
   type.
qp_sizepart.h:65: error: 'PedSector' is used as a type, but is not defined as a
   type.
qp_sizepart.h:66: error: 'PedSector' is used as a type, but is not defined as a
   type.
qp_sizepart.h:67: error: 'PedSector' is used as a type, but is not defined as a
   type.
qp_sizepart.h:70: error: `PedSector' was not declared in this scope
qp_sizepart.h:70: error: invalid data member initialization
qp_sizepart.h:70: error: variable or field `sigChangedStart' declared void
qp_sizepart.h:71: error: `PedSector' was not declared in this scope
qp_sizepart.h:71: error: invalid data member initialization
qp_sizepart.h:71: error: variable or field `sigChangedEnd' declared void
qp_sizepart.h:72: error: `PedSector' was not declared in this scope
qp_sizepart.h:72: error: `PedSector' was not declared in this scope
qp_sizepart.h:72: error: invalid data member initialization
qp_sizepart.h:72: error: variable or field `sigChangedPos' declared void
In file included from qp_window.h:42,
                 from main.cpp:37:
qp_dlgresize.h:47: error: `PedSector' was not declared in this scope
qp_dlgresize.h:47: error: invalid data member initialization
qp_dlgresize.h:47: error: variable or field `setMaxPartSector' declared void
qp_dlgresize.h:48: error: `PedSector' was not declared in this scope
qp_dlgresize.h:48: error: invalid data member initialization
qp_dlgresize.h:48: error: variable or field `setMinPartSector' declared void
qp_dlgresize.h:49: error: `PedSector' was not declared in this scope
qp_dlgresize.h:49: error: invalid data member initialization
qp_dlgresize.h:49: error: variable or field `setStartPartSector' declared void
qp_dlgresize.h:50: error: `PedSector' was not declared in this scope
qp_dlgresize.h:50: error: invalid data member initialization
qp_dlgresize.h:50: error: variable or field `setEndPartSector' declared void
qp_dlgresize.h:51: error: `PedSector' was not declared in this scope
qp_dlgresize.h:51: error: invalid data member initialization
qp_dlgresize.h:51: error: variable or field `setGrowStartPartSector' declared
   void
qp_dlgresize.h:52: error: `PedSector' was not declared in this scope
qp_dlgresize.h:52: error: invalid data member initialization
qp_dlgresize.h:52: error: variable or field `setGrowEndPartSector' declared
   void
qp_dlgresize.h:60: error: 'PedSector' is used as a type, but is not defined as
   a type.
qp_dlgresize.h:61: error: 'PedSector' is used as a type, but is not defined as
   a type.
qp_dlgresize.h:62: error: 'PedSector' is used as a type, but is not defined as
   a type.
qp_dlgresize.h:63: error: 'PedSector' is used as a type, but is not defined as
   a type.
qp_dlgresize.h:64: error: 'PedSector' is used as a type, but is not defined as
   a type.
qp_dlgresize.h:65: error: 'PedSector' is used as a type, but is not defined as
   a type.
qp_dlgresize.h:69: error: `PedSector' was not declared in this scope
qp_dlgresize.h:69: error: invalid data member initialization
qp_dlgresize.h:69: error: variable or field `slotChangedStart' declared void
qp_dlgresize.h:70: error: `PedSector' was not declared in this scope
qp_dlgresize.h:70: error: invalid data member initialization
qp_dlgresize.h:70: error: variable or field `slotChangedEnd' declared void
qp_dlgresize.h:71: error: `PedSector' was not declared in this scope
qp_dlgresize.h:71: error: `PedSector' was not declared in this scope
qp_dlgresize.h:71: error: invalid data member initialization
qp_dlgresize.h:71: error: variable or field `slotChangedPos' declared void
qp_dlgresize.h:72: error: `PedSector' was not declared in this scope
qp_dlgresize.h:72: error: invalid data member initialization
qp_dlgresize.h:72: error: variable or field `slotFreeBeforeChanged' declared
   void
qp_dlgresize.h:73: error: `PedSector' was not declared in this scope
qp_dlgresize.h:73: error: invalid data member initialization
qp_dlgresize.h:73: error: variable or field `slotFreeAfterChanged' declared
   void
qp_dlgresize.h:74: error: `PedSector' was not declared in this scope
qp_dlgresize.h:74: error: invalid data member initialization
qp_dlgresize.h:74: error: variable or field `slotNewSizeChanged' declared void
In file included from main.cpp:41:
qp_debug.h:26:31: warning: ISO C does not permit named variadic macros
make[3]: *** [main.o] Error 1
make[3]: Leaving directory `/home/sevcsik/Desktop/qtparted-0.4.4/src'
make[2]: *** [all-recursive] Error 1
make[2]: Leaving directory `/home/sevcsik/Desktop/qtparted-0.4.4/src'
make[1]: *** [all-recursive] Error 1
make[1]: Leaving directory `/home/sevcsik/Desktop/qtparted-0.4.4'
make: *** [all] Error 2
I'm in root, so I don't get it

please help
thx
 
  


Reply


Thread Tools Search this Thread
Search this Thread:

Advanced Search

Posting Rules
You may not post new threads
You may not post replies
You may not post attachments
You may not edit your posts

BB code is On
Smilies are On
[IMG] code is Off
HTML code is Off



Similar Threads
Thread Thread Starter Forum Replies Last Post
QTParted mount error cerin Linux - Software 1 12-03-2005 08:59 PM
Partitioning resizing error in QTparted Garibaldi3489 Slackware 2 01-22-2005 04:00 PM
error installing qtparted NonSumPisces Linux - Software 0 07-22-2004 04:34 PM
can't compile qtparted, config OK, make failing slackist Linux - Software 3 06-03-2004 10:19 AM
compile error: #error unknown processor family kmack2001 Linux - Newbie 0 02-14-2004 12:52 PM


All times are GMT -5. The time now is 02:28 AM.

Main Menu
Advertisement
My LQ
Write for LQ
LinuxQuestions.org is looking for people interested in writing Editorials, Articles, Reviews, and more. If you'd like to contribute content, let us know.
Main Menu
Syndicate
RSS1  Latest Threads
RSS1  LQ News
Twitter: @linuxquestions
Facebook: linuxquestions Google+: linuxquestions
Open Source Consulting | Domain Registration