LinuxQuestions.org
Welcome to the most active Linux Forum on the web.
Go Back   LinuxQuestions.org > Forums > Linux Forums > Linux - Distributions > Slackware
User Name
Password
Slackware This Forum is for the discussion of Slackware Linux.

Notices


Reply
  Search this Thread
Old 11-08-2016, 10:44 AM   #1
glupa4e
Member
 
Registered: Jan 2011
Posts: 248

Rep: Reputation: 2
Slackware 14.2 - Libquicktime-1.2.4 from SlackBuilds fails to install


Hello i was trying to install libquicktime from the SlackBbuilds repository
but it gave the following error:
Code:
/bin/sh ../../libtool --tag=CC   --mode=link gcc -I/usr/include -DLOCALE_DIR=\"/usr/share/locale\" -O2 -fPIC  -finline-functions -Wall -Winline -Wmissing-declarations -Wdeclaration-after-statement -fvisibility=hidden -avoid-version -module  -o lqt_vorbis.la -rpath /usr/lib64/libquicktime vorbis.lo lqt_vorbis.lo ../../src/libquicktime.la -lvorbisenc -L/usr/lib -lvorbis -lm -lvorbisfile -lpthread -lm -lz -ldl 
libtool: link: gcc -shared  .libs/vorbis.o .libs/lqt_vorbis.o   -Wl,-rpath -Wl,/tmp/SBo/libquicktime-1.2.4/src/.libs ../../src/.libs/libquicktime.so /usr/lib/libvorbisenc.so -L/usr/lib /usr/lib/libvorbis.so /usr/lib/libvorbisfile.so -lpthread -lm -lz -ldl    -Wl,-soname -Wl,lqt_vorbis.so -o .libs/lqt_vorbis.so
/usr/lib/libvorbisenc.so: error adding symbols: File in wrong format
collect2: error: ld returned 1 exit status
Makefile:374: recipe for target 'lqt_vorbis.la' failed
make[3]: *** [lqt_vorbis.la] Error 1
make[3]: Leaving directory '/tmp/SBo/libquicktime-1.2.4/plugins/vorbis'
Makefile:371: recipe for target 'all-recursive' failed
make[2]: *** [all-recursive] Error 1
make[2]: Leaving directory '/tmp/SBo/libquicktime-1.2.4/plugins'
Makefile:444: recipe for target 'all-recursive' failed
make[1]: *** [all-recursive] Error 1
make[1]: Leaving directory '/tmp/SBo/libquicktime-1.2.4'
Makefile:351: recipe for target 'all' failed
make: *** [all] Error 2
Unfortunately i could not install it.

Any idea if that could be fixed?
 
Old 11-08-2016, 10:51 AM   #2
ponce
Senior Member
 
Registered: Aug 2004
Location: Pisa, Italy
Distribution: Slackware
Posts: 4,932

Rep: Reputation: Disabled
most probably you are trying to build libquicktime on a multilib system: please refer to https://slackbuilds.org/faq/#multilib
 
2 members found this post helpful.
  


Reply


Thread Tools Search this Thread
Search this Thread:

Advanced Search

Posting Rules
You may not post new threads
You may not post replies
You may not post attachments
You may not edit your posts

BB code is On
Smilies are On
[IMG] code is Off
HTML code is Off



Similar Threads
Thread Thread Starter Forum Replies Last Post
[SOLVED] Can't install libgksu from SlackBuilds in Slackware 64 current glats Slackware 4 04-01-2015 07:36 AM
[SOLVED] unable to install libquicktime on slackware64 14.1 allenlinux Slackware 13 03-04-2015 07:02 PM
Trying to make libgdiplus from SlackBuilds for 13.37; compilation fails mostlyharmless Slackware 2 09-29-2012 03:18 PM
[SOLVED] Slackware 13 64bit: First time using SlackBuilds and unable to install programs. Switch7 Slackware 19 10-08-2009 09:26 AM
libsndfile from Slackbuilds.org fails to build... Lufbery Slackware 10 01-09-2009 08:41 AM

LinuxQuestions.org > Forums > Linux Forums > Linux - Distributions > Slackware

All times are GMT -5. The time now is 09:19 AM.

Main Menu
Advertisement
My LQ
Write for LQ
LinuxQuestions.org is looking for people interested in writing Editorials, Articles, Reviews, and more. If you'd like to contribute content, let us know.
Main Menu
Syndicate
RSS1  Latest Threads
RSS1  LQ News
Twitter: @linuxquestions
Facebook: linuxquestions Google+: linuxquestions
Open Source Consulting | Domain Registration