LinuxQuestions.org
Share your knowledge at the LQ Wiki.
Go Back   LinuxQuestions.org > Forums > Linux Forums > Linux - Distributions > Slackware
User Name
Password
Slackware This Forum is for the discussion of Slackware Linux.

Notices


Reply
  Search this Thread
Old 05-24-2020, 04:10 AM   #211
dchmelik
Member
 
Registered: Nov 2008
Location: USA
Distribution: FreeBSD Unix, Slackware, FreeSlack GNU/Linux, OpenBSD Unix, FreeDOS
Posts: 466

Rep: Reputation: 51

Stable version works... don't know if I need current version but the below happens.

Code:
user@host:~/sboui-d078904ad3bdfed5b07339c4257dc407ce91130b/build$ make
[  1%] Linking CXX executable sboui
/usr/bin/ld: cannot find -ltinfo
collect2: error: ld returned 1 exit status
make[2]: *** [CMakeFiles/sboui.dir/build.make:872: sboui] Error 1
make[1]: *** [CMakeFiles/Makefile2:96: CMakeFiles/sboui.dir/all] Error 2
make: *** [Makefile:150: all] Error 2
 
Old 05-24-2020, 05:37 AM   #212
montagdude
Senior Member
 
Registered: Apr 2016
Distribution: Slackware
Posts: 1,760

Original Poster
Rep: Reputation: 1339Reputation: 1339Reputation: 1339Reputation: 1339Reputation: 1339Reputation: 1339Reputation: 1339Reputation: 1339Reputation: 1339Reputation: 1339
Quote:
Originally Posted by dchmelik View Post
Stable version works... don't know if I need current version but the below happens.

Code:
user@host:~/sboui-d078904ad3bdfed5b07339c4257dc407ce91130b/build$ make
[  1%] Linking CXX executable sboui
/usr/bin/ld: cannot find -ltinfo
collect2: error: ld returned 1 exit status
make[2]: *** [CMakeFiles/sboui.dir/build.make:872: sboui] Error 1
make[1]: *** [CMakeFiles/Makefile2:96: CMakeFiles/sboui.dir/all] Error 2
make: *** [Makefile:150: all] Error 2
It builds fine here. Why are you running make from inside the source directory? Just run the SlackBuild from SBo with this change:

Code:
VERSION=${VERSION:-d078904ad3bdfed5b07339c4257dc407ce91130b}
 
Old 05-24-2020, 11:28 PM   #213
dchmelik
Member
 
Registered: Nov 2008
Location: USA
Distribution: FreeBSD Unix, Slackware, FreeSlack GNU/Linux, OpenBSD Unix, FreeDOS
Posts: 466

Rep: Reputation: 51
Quote:
Originally Posted by montagdude View Post
It builds fine here. Why are you running make from inside the source directory? Just run the SlackBuild from SBo with this change:

Code:
VERSION=${VERSION:-d078904ad3bdfed5b07339c4257dc407ce91130b}
Done. Same thing happened.
 
Old 05-25-2020, 06:50 AM   #214
montagdude
Senior Member
 
Registered: Apr 2016
Distribution: Slackware
Posts: 1,760

Original Poster
Rep: Reputation: 1339Reputation: 1339Reputation: 1339Reputation: 1339Reputation: 1339Reputation: 1339Reputation: 1339Reputation: 1339Reputation: 1339Reputation: 1339
Quote:
Originally Posted by dchmelik View Post
Done. Same thing happened.
I just built it on a clean, up-to-date -current and it worked fine. And there's nothing in the new version that would cause any difference in linking compared to 2.1, so I think you must either have something wrong with your system or be doing something wrong when you try to build. I can give you the package I just built if you want. FYI, this commit is the only significant difference between 2.1 and the latest master:

Quote:
Create complete-as-possible build order when deps are missing

This is a follow-on to 66b6add, which allowed the build to proceed but
stopped computing the build order when a dependency was missing in the
chain. This commit continues computing the build order, skipping any
missing dependencies, in such cases. A warning is still presented to the
user.
This is helpful for -current, because SlackBuilds get removed from the tree when they are added by Pat. This allows the build order to be created correctly even though some dependencies are missing from the tree (but present in the base system).

Last edited by montagdude; 05-25-2020 at 06:55 AM.
 
  


Reply


Thread Tools Search this Thread
Search this Thread:

Advanced Search

Posting Rules
You may not post new threads
You may not post replies
You may not post attachments
You may not edit your posts

BB code is On
Smilies are On
[IMG] code is Off
HTML code is Off



Similar Threads
Thread Thread Starter Forum Replies Last Post
[SOLVED] Call for Testers: MATE 1.17 willysr Slackware 25 04-21-2017 12:55 PM
[SOLVED] Call for Testers: MATE 1.14 for -Current willysr Slackware 13 05-27-2016 08:08 AM
Updating w3af to version 1.6.49 in SBo, need testers mralk3 Slackware 3 12-12-2015 05:54 PM
Call for Testers: MATE 1.8 willysr Slackware 137 08-06-2014 01:50 AM
ncurses-5.2-28 conflicts with file from package ncurses-5.2-12 tubby Linux - Software 4 06-16-2002 12:00 AM

LinuxQuestions.org > Forums > Linux Forums > Linux - Distributions > Slackware

All times are GMT -5. The time now is 07:50 PM.

Main Menu
Advertisement
My LQ
Write for LQ
LinuxQuestions.org is looking for people interested in writing Editorials, Articles, Reviews, and more. If you'd like to contribute content, let us know.
Main Menu
Syndicate
RSS1  Latest Threads
RSS1  LQ News
Twitter: @linuxquestions
Facebook: linuxquestions Google+: linuxquestions
Open Source Consulting | Domain Registration