-   Slackware (
-   -   Problem building PulseAudio on Slackware 14 (

stormtracknole 03-20-2013 10:54 AM

Problem building PulseAudio on Slackware 14
Having some issue building pulseaudio from Here's the error that it hangs up on:

collect2: error: ld returned 1 exit status
libtool: install: error: relink `' with the above command before installing it
make[5]: *** [install-modlibexecLTLIBRARIES] Error 1
make[5]: *** Waiting for unfinished jobs....

After searching that error on Google, I found that it can be related to using the -j argument for make. The solution for this problem suggested to use no argument or just use -j1. However, I still run into the same problem.

Any suggestions?

stormtracknole 03-20-2013 11:20 AM

Arghhh...never mind. I forgot that I had upgraded my netbook to -Current. I have confirmed that it does indeed build with Slackware 14. I'm sure my problem is related to the new gcc. Will try the latest version next.

I will mark this as solved.

All times are GMT -5. The time now is 06:01 AM.