Share your knowledge at the LQ Wiki.
Go Back > Forums > Linux Forums > Linux - Distributions > Slackware
User Name
Slackware This Forum is for the discussion of Slackware Linux.


  Search this Thread
Old 04-05-2021, 09:11 PM   #1
LQ Newbie
Registered: Apr 2021
Location: Pennsylvania, USA
Distribution: Slackware 14.2
Posts: 3

Rep: Reputation: Disabled
Question libshout 'tls.c' errors installing VLC

I got libshout 2.3.1 from slackbuilds. It took a while to get this far into the process. I'm about to depart for work so hopefully, someone has something resembling a solution when I get home.

I'm using Alien's slackbuild for VLC, by the way. I appreciate any help I can get!

make[4]: Entering directory '/tmp/build/tmp-vlc/vlc-3.0.12/modules'
/tmp/build/tmp-vlc/vlcdeps/usr/lib64/libshout.a(tls.o): In function `shout_tls_try_connect':
tls.c:(.text+0x72): undefined reference to `SSL_is_init_finished'
tls.c:(.text+0x91): undefined reference to `SSL_is_init_finished'
tls.c:(.text+0x4bb): undefined reference to `OPENSSL_init_ssl'
tls.c:(.text+0x4c7): undefined reference to `OPENSSL_init_ssl'
tls.c:(.text+0x4ce): undefined reference to `SSLeay_add_all_algorithms'
tls.c:(.text+0x4d7): undefined reference to `OPENSSL_init_ssl'
collect2: error: ld returned 1 exit status
Makefile:12865: recipe for target '' failed
make[4]: *** [] Error 1
make[4]: Leaving directory '/tmp/build/tmp-vlc/vlc-3.0.12/modules'
Makefile:26681: recipe for target 'install-recursive' failed
make[3]: *** [install-recursive] Error 1
make[3]: Leaving directory '/tmp/build/tmp-vlc/vlc-3.0.12/modules'
Makefile:27094: recipe for target 'install' failed
make[2]: *** [install] Error 2
make[2]: Leaving directory '/tmp/build/tmp-vlc/vlc-3.0.12/modules'
Makefile:1558: recipe for target 'install-recursive' failed
make[1]: *** [install-recursive] Error 1
make[1]: Leaving directory '/tmp/build/tmp-vlc/vlc-3.0.12'
Makefile:2024: recipe for target 'install' failed
make: *** [install] Error 2
touch: cannot touch '/tmp/build/package-vlc/usr/lib64/vlc/plugins/plugins.dat': No such file or directory
Old 04-06-2021, 04:15 AM   #2
Registered: Sep 2009
Distribution: Slackware
Posts: 31

Rep: Reputation: 18
Needed for version vlc-3.0.12

You can also try with the latest version :

Last edited by marco70; 04-06-2021 at 04:22 AM.
1 members found this post helpful.
Old 04-06-2021, 10:41 AM   #3
LQ Newbie
Registered: Apr 2021
Location: Pennsylvania, USA
Distribution: Slackware 14.2
Posts: 3

Original Poster
Rep: Reputation: Disabled
Hah, it's usually the little things. Thanks a bunch, that got it going!


Thread Tools Search this Thread
Search this Thread:

Advanced Search

Posting Rules
You may not post new threads
You may not post replies
You may not post attachments
You may not edit your posts

BB code is On
Smilies are On
[IMG] code is Off
HTML code is Off

Similar Threads
Thread Thread Starter Forum Replies Last Post
VLC error: VLC could not open the file "/usr/share/vlc/skins2/text.bmp". brjoon1021 Ubuntu 1 01-14-2009 10:48 PM
errno: TLS definition in /lib64/ section .tbss mismatches non-TLS reference johnpaulodonnell Programming 2 07-25-2008 04:37 AM
/usr/bin/ld: errno TLS def.. mismatches non-TLS def.. maverick_pol Fedora 1 07-27-2007 10:50 AM
Installing libshout libraries mrsolo Linux - Software 1 07-01-2006 12:29 PM
libshout can't find Ogg Vorbis Cyber Maid Linux - Software 1 03-06-2005 03:46 AM > Forums > Linux Forums > Linux - Distributions > Slackware

All times are GMT -5. The time now is 04:52 AM.

Main Menu
Write for LQ is looking for people interested in writing Editorials, Articles, Reviews, and more. If you'd like to contribute content, let us know.
Main Menu
RSS1  Latest Threads
RSS1  LQ News
Twitter: @linuxquestions
Open Source Consulting | Domain Registration