LinuxQuestions.org
Download your favorite Linux distribution at LQ ISO.
Go Back   LinuxQuestions.org > Forums > Linux Forums > Linux - Distributions > Slackware
User Name
Password
Slackware This Forum is for the discussion of Slackware Linux.

Notices


Reply
  Search this Thread
Old 01-03-2005, 10:42 PM   #1
drakethegreat
Member
 
Registered: Sep 2004
Location: Seattle, WA
Distribution: None (Linux doesn't support my basic hardware)
Posts: 61

Rep: Reputation: 15
Compile errors with libgnomeui


I'm attempting to compile libgnomeui and have been compiling in the order according to the gnome website. The configuration worked fine but when I run make I'm getting a heck of a lot of undeclared variables and functions. The output I have pasted below. I would guess that its a dependency problem but I'm confused why ./configure didn't catch it.

Code:
gnome-authentication-manager.c: In function `construct_full_password_dialog':
gnome-authentication-manager.c:316: error: `GNOME_VFS_MODULE_CALLBACK_FULL_AUTHENTICATION_ANON_SUPPORTED' undeclared (first use in this function)
gnome-authentication-manager.c:316: error: (Each undeclared identifier is reported only once
gnome-authentication-manager.c:316: error: for each function it appears in.)
gnome-authentication-manager.c: In function `full_auth_get_result_from_dialog':
gnome-authentication-manager.c:338: error: structure has no member named `out_flags'
gnome-authentication-manager.c:340: error: structure has no member named `out_flags'
gnome-authentication-manager.c:340: error: `GNOME_VFS_MODULE_CALLBACK_FULL_AUTHENTICATION_OUT_ANON_SELECTED' undeclared (first use in this function)
gnome-authentication-manager.c: At top level:
gnome-authentication-manager.c:747: warning: type defaults to `int' in declaration of `GnomeVFSModuleCallbackQuestionIn'
gnome-authentication-manager.c:747: warning: no semicolon at end of struct or union
gnome-authentication-manager.c:747: error: parse error before '*' token
gnome-authentication-manager.c:748: warning: type defaults to `int' in declaration of `out_args'
gnome-authentication-manager.c:748: warning: data definition has no type or storage class
gnome-authentication-manager.c:752: error: parse error before '}' token
gnome-authentication-manager.c:752: warning: type defaults to `int' in declaration of `QuestionCallbackInfo'
gnome-authentication-manager.c:752: warning: data definition has no type or storage class
gnome-authentication-manager.c:757: error: parse error before "QuestionCallbackInfo"
gnome-authentication-manager.c: In function `question_dialog_button_clicked':
gnome-authentication-manager.c:759: error: `info' undeclared (first use in this function)
gnome-authentication-manager.c:759: error: `button_number' undeclared (first use in this function)
gnome-authentication-manager.c:760: error: `dialog' undeclared (first use in this function)
gnome-authentication-manager.c: At top level:
gnome-authentication-manager.c:765: error: parse error before "QuestionCallbackInfo"
gnome-authentication-manager.c: In function `question_dialog_destroyed':
gnome-authentication-manager.c:767: error: `info' undeclared (first use in this function)
gnome-authentication-manager.c: At top level:
gnome-authentication-manager.c:773: error: parse error before "QuestionCallbackInfo"
gnome-authentication-manager.c: In function `question_dialog_closed':
gnome-authentication-manager.c:775: error: `dialog' undeclared (first use in this function)
gnome-authentication-manager.c: At top level:
gnome-authentication-manager.c:800: error: parse error before '*' token
gnome-authentication-manager.c: In function `present_question_dialog_nonblocking':
gnome-authentication-manager.c:805: error: `info' undeclared (first use in this function)
gnome-authentication-manager.c: In function `vfs_async_question_callback':
gnome-authentication-manager.c:844: error: `GnomeVFSModuleCallbackQuestionIn' undeclared (first use in this function)
gnome-authentication-manager.c:844: error: `in_real' undeclared (first use in this function)
gnome-authentication-manager.c:845: error: `GnomeVFSModuleCallbackQuestionOut' undeclared (first use in this function)
gnome-authentication-manager.c:845: error: `out_real' undeclared (first use in this function)
gnome-authentication-manager.c:846: error: `info' undeclared (first use in this function)
gnome-authentication-manager.c:854: error: parse error before ')' token
gnome-authentication-manager.c:855: error: parse error before ')' token
gnome-authentication-manager.c:859: error: parse error before ')' token
gnome-authentication-manager.c: In function `vfs_question_callback':
gnome-authentication-manager.c:874: error: `GnomeVFSModuleCallbackQuestionIn' undeclared (first use in this function)
gnome-authentication-manager.c:874: error: `in_real' undeclared (first use in this function)
gnome-authentication-manager.c:875: error: `GnomeVFSModuleCallbackQuestionOut' undeclared (first use in this function)
gnome-authentication-manager.c:875: error: `out_real' undeclared (first use in this function)
gnome-authentication-manager.c:884: error: parse error before ')' token
gnome-authentication-manager.c:885: error: parse error before ')' token
gnome-authentication-manager.c: In function `gnome_authentication_manager_init':
gnome-authentication-manager.c:928: error: `GNOME_VFS_MODULE_CALLBACK_QUESTION' undeclared (first use in this function)
gnome-authentication-manager.c: In function `gnome_authentication_manager_push_async':
gnome-authentication-manager.c:989: error: `GNOME_VFS_MODULE_CALLBACK_QUESTION' undeclared (first use in this function)
gnome-authentication-manager.c: In function `gnome_authentication_manager_pop_async':
gnome-authentication-manager.c:1003: error: `GNOME_VFS_MODULE_CALLBACK_QUESTION' undeclared (first use in this function)
gnome-authentication-manager.c: In function `gnome_authentication_manager_push_sync':
gnome-authentication-manager.c:1031: error: `GNOME_VFS_MODULE_CALLBACK_QUESTION' undeclared (first use in this function)
gnome-authentication-manager.c: In function `gnome_authentication_manager_pop_sync':
gnome-authentication-manager.c:1045: error: `GNOME_VFS_MODULE_CALLBACK_QUESTION' undeclared (first use in this function)
cc1: Permission denied: opening dependency file .deps/gnome-authentication-manager.Tpo
make[4]: *** [gnome-authentication-manager.lo] Error 1
make[4]: Leaving directory `/home/drake/libgnomeui-2.8.0/libgnomeui'
make[3]: *** [all-recursive] Error 1
make[3]: Leaving directory `/home/drake/libgnomeui-2.8.0/libgnomeui'
make[2]: *** [all] Error 2
make[2]: Leaving directory `/home/drake/libgnomeui-2.8.0/libgnomeui'
make[1]: *** [all-recursive] Error 1
make[1]: Leaving directory `/home/drake/libgnomeui-2.8.0'
make: *** [all] Error 2
 
Old 01-04-2005, 04:55 AM   #2
__J
Senior Member
 
Registered: Dec 2004
Distribution: Slackware, ROCK
Posts: 1,973

Rep: Reputation: 46
Need to see up above where you started. With that many errors and syntax errors most likely it had a problem finding a header file. You could grep that output for the line "No such file or directory" and see what it needs.
 
Old 01-04-2005, 01:52 PM   #3
drakethegreat
Member
 
Registered: Sep 2004
Location: Seattle, WA
Distribution: None (Linux doesn't support my basic hardware)
Posts: 61

Original Poster
Rep: Reputation: 15
No such file or directory
make: *** [all] Broken pipe

That is all I got from the grep search. I tried using contexts with grep but couldn't get anything else.
 
Old 01-04-2005, 04:10 PM   #4
__J
Senior Member
 
Registered: Dec 2004
Distribution: Slackware, ROCK
Posts: 1,973

Rep: Reputation: 46
do:

make &> make.log

this will create a file with the output in the current directory.

Some header is missing somewhere because it is complaining about undeclared identifiers and type mismaches.

What version are you trying to compile?
Are you installing it ( and its dependencies) in an nonstandard prefix?
Where did you install gnome-vfs?
 
Old 01-04-2005, 05:04 PM   #5
drakethegreat
Member
 
Registered: Sep 2004
Location: Seattle, WA
Distribution: None (Linux doesn't support my basic hardware)
Posts: 61

Original Poster
Rep: Reputation: 15
http://www.drakesland.com/make.log

I posted the log file there. I already checked the output but still couldn't find anything. This log file is probably the only one thats useful but would you like the one for the configure file to take a quick peak?
 
  


Reply


Thread Tools Search this Thread
Search this Thread:

Advanced Search

Posting Rules
You may not post new threads
You may not post replies
You may not post attachments
You may not edit your posts

BB code is On
Smilies are On
[IMG] code is Off
HTML code is Off



Similar Threads
Thread Thread Starter Forum Replies Last Post
libgnomeui compile/link problems with Mandrake 10.2 Spooled Linux - Software 2 08-31-2005 05:45 PM
compile errors davidleroux1 Programming 4 05-10-2005 10:03 PM
Where to download libgnomeui-2.0.0? gobi_dgm Linux - Software 2 05-06-2005 05:24 AM
libgnomeui is preventing install lejakl Linux - Newbie 2 08-07-2003 09:14 PM
Compile Errors userini Linux - Software 6 07-16-2003 08:22 AM

LinuxQuestions.org > Forums > Linux Forums > Linux - Distributions > Slackware

All times are GMT -5. The time now is 02:55 PM.

Main Menu
Advertisement
My LQ
Write for LQ
LinuxQuestions.org is looking for people interested in writing Editorials, Articles, Reviews, and more. If you'd like to contribute content, let us know.
Main Menu
Syndicate
RSS1  Latest Threads
RSS1  LQ News
Twitter: @linuxquestions
Open Source Consulting | Domain Registration