Share your knowledge at the LQ Wiki.
Go Back > Forums > Linux Forums > Linux - Distributions > Slackware
User Name
Slackware This Forum is for the discussion of Slackware Linux.


  Search this Thread
Old 04-08-2021, 11:45 AM   #1
LQ Newbie
Registered: May 2020
Posts: 19

Rep: Reputation: Disabled
new webkit2gtk doesn't build on current

When I try to update to 2.20.5 I get this error:

[ 36%] Building CXX object Source/WebCore/CMakeFiles/ANGLESupport.dir/__/ThirdParty/ANGLE/src/libANGLE/Platform.cpp.o
In file included from /tmp/SBo/webkitgtk-2.20.5/Source/ThirdParty/ANGLE/src/libANGLE/Platform.cpp:9:
/tmp/SBo/webkitgtk-2.20.5/Source/ThirdParty/ANGLE/include/platform/Platform.h:239:35: error: ‘size_t’ has not been declared
239 | size_t programSize,
| ^~~~~~
/tmp/SBo/webkitgtk-2.20.5/Source/ThirdParty/ANGLE/include/platform/Platform.h:243:33: error: ‘size_t’ has not been declared
243 | size_t programSize,
| ^~~~~~
make[2]: *** [Source/WebCore/CMakeFiles/ANGLESupport.dir/build.make:1854: Source/WebCore/CMakeFiles/ANGLESupport.dir/__/ThirdParty/ANGLE/src/libANGLE/Platform.cpp.o] Error 1
make[2]: *** Waiting for unfinished jobs....
make[1]: *** [CMakeFiles/Makefile2:814: Source/WebCore/CMakeFiles/ANGLESupport.dir/all] Error 2
make: *** [Makefile:156: all] Error 2

EDIT: oh nevermind, the ponce repo got reverted back to the old 2.20.5 version for some reason.

Last edited by sasha69; 04-08-2021 at 11:55 AM.
Old 04-08-2021, 12:39 PM   #2
LQ Guru
Registered: Aug 2004
Location: Pisa, Italy
Distribution: Slackware
Posts: 6,079

Rep: Reputation: Disabled
yes, that happened because of an oversight (I had branched it over the wrong commit and the merged failed), but it should be fixed in the just-pushed latest version of the repository: thanks for noticing!


Thread Tools Search this Thread
Search this Thread:

Advanced Search

Posting Rules
You may not post new threads
You may not post replies
You may not post attachments
You may not edit your posts

BB code is On
Smilies are On
[IMG] code is Off
HTML code is Off

Similar Threads
Thread Thread Starter Forum Replies Last Post
[SOLVED] webkit2gtk elicits systemd-journal flying-tuxman Linux - Software 2 01-22-2021 01:45 PM
[SOLVED] Error compiling webkit2gtk 2.30.2 on current sasha69 Slackware 8 12-08-2020 09:55 PM
[SOLVED] Linux 4.4 seems to refuse to build IPv6 for the 64-bit build - 32-bit build works fine GameCodingNinja Linux From Scratch 2 02-07-2016 06:40 PM
build doesn't stop even if one of the components failed to build 5883 Programming 1 11-12-2012 09:38 AM
LXer: Build 'em Right, Build 'em Strong, Build 'em Linux LXer Syndicated Linux News 0 10-01-2007 09:51 PM > Forums > Linux Forums > Linux - Distributions > Slackware

All times are GMT -5. The time now is 11:53 AM.

Main Menu
Write for LQ is looking for people interested in writing Editorials, Articles, Reviews, and more. If you'd like to contribute content, let us know.
Main Menu
RSS1  Latest Threads
RSS1  LQ News
Twitter: @linuxquestions
Open Source Consulting | Domain Registration