LinuxQuestions.org
Help answer threads with 0 replies.
Go Back   LinuxQuestions.org > Forums > Linux Forums > Linux - Software
User Name
Password
Linux - Software This forum is for Software issues.
Having a problem installing a new program? Want to know which application is best for the job? Post your question in this forum.

Notices


Reply
  Search this Thread
Old 03-22-2005, 03:19 PM   #1
drumstick
Member
 
Registered: Mar 2005
Location: Istanbul
Distribution: Ubuntu Desktop 6.06, SuSE Linux 9.3 Professional
Posts: 35

Rep: Reputation: 15
Upgrading to KDE3.4


Hi all,

I am a newbie to Linux. I use SuSE 9.2 eval
I wanted to upgrade my KDE to 3.4

But I received that error while upgrading:

make[6]: Entering directory `/home/drumstick/Documents/konstruct/libs/qt-x11-fre e/work/qt-x11-free-3.3.4/src'
g++ -c -pipe -fno-exceptions -Wall -W -O2 -pipe -D_REENTRANT -fPIC -DQT_SHARED - DQT_NO_DEBUG -DQT_THREAD_SUPPORT -DQT_THREAD_SUPPORT -DQT_NO_CUPS -D_LARGEFILE_S OURCE -D_LARGE_FILES -D_FILE_OFFSET_BITS=64 -DQT_NO_XINERAMA -DQT_NO_SHAPE -DQT_ NO_XCURSOR -DQT_NO_XRANDR -DQT_NO_XRENDER -DQT_NO_XFTFREETYPE -DQT_NO_XKB -DQT_N O_SM_SUPPORT -DQT_NO_IMAGEIO_MNG -DQT_NO_IMAGEIO_JPEG -DQT_BUILTIN_GIF_READER=1 -DQT_NO_STYLE_MAC -DQT_NO_STYLE_AQUA -DQT_NO_STYLE_INTERLACE -DQT_NO_STYLE_WINDO WSXP -DQT_NO_STYLE_COMPACT -DQT_NO_STYLE_POCKETPC -I/home/drumstick/Documents/ko nstruct/libs/qt-x11-free/work/qt-x11-free-3.3.4/mkspecs/linux-g++ -I. -I../inclu de -I/usr/X11R6/include -I.moc/release-shared-mt/ -o .obj/release-shared-mt/qtad dons_x11.o kernel/qtaddons_x11.cpp
In file included from kernel/qtaddons_x11.cpp:25:
kernel/qt_x11_p.h:66:22: X11/Xlib.h: No such file or directory
kernel/qt_x11_p.h:71:23: X11/Xutil.h: No such file or directory
kernel/qt_x11_p.h:72:21: X11/Xos.h: No such file or directory
kernel/qt_x11_p.h:73:23: X11/Xatom.h: No such file or directory
make[6]: *** [.obj/release-shared-mt/qtaddons_x11.o] Error 1
make[6]: Leaving directory `/home/drumstick/Documents/konstruct/libs/qt-x11-free /work/qt-x11-free-3.3.4/src'
make[5]: *** [sub-src] Error 2
make[5]: Leaving directory `/home/drumstick/Documents/konstruct/libs/qt-x11-free /work/qt-x11-free-3.3.4'
make[4]: *** [build-work/qt-x11-free-3.3.4/Makefile] Error 2
make[4]: Leaving directory `/home/drumstick/Documents/konstruct/libs/qt-x11-free '
make[3]: *** [dep-../../libs/qt-x11-free] Error 2
make[3]: Leaving directory `/home/drumstick/Documents/konstruct/libs/arts'
make[2]: *** [dep-../../libs/arts] Error 2
make[2]: Leaving directory `/home/drumstick/Documents/konstruct/kde/kdelibs'
make[1]: *** [dep-../../kde/kdelibs] Error 2
make[1]: Leaving directory `/home/drumstick/Documents/konstruct/kde/kdebase'
make: *** [dep-../../kde/kdebase] Error 2
drumstick@linux:~/Documents/konstruct/meta/kde>


make[1]: Leaving directory `/home/drumstick/Documents/konstruct/kde/kdebase'
make: *** [dep-../../kde/kdebase] Error 2


What does that mean?

I'd be very happy if you can help...

Thanks in advance...
 
Old 03-22-2005, 03:39 PM   #2
KimVette
Senior Member
 
Registered: Dec 2004
Location: Lee, NH
Distribution: OpenSUSE, CentOS, RHEL
Posts: 1,794

Rep: Reputation: 46
Why did you post the same exact thread to two different forums? The mods tend to enforce crossposting rules rather strictly.

ANYWAY to answer your question:

Note the errors: complaints about missing files and directories. Rather than spoon-feed you I will help you learn how to resolve the dependencies.

In one error, the compiler is complaining about Xlib.h's not being present, or not being where the compiler expects it -- or you forgot to run ./configure prior to running make. In either case, try re-running ./configure in the project's directory. I see that since you also posted this topic in the Suse/Novell forum that you are running Suse Linux - in that case, Xlib.h should be located in /usr/X11R6/include/X11/Xlib.h and not {...current working directory...}/X11/Xlib.h

Xlib.h is one of the X library header files required in order to compile programs which link to those libraries. If after you run ./configure in the project directory, the compiler still cannot find the library, you need to install the development headers.
 
  


Reply


Thread Tools Search this Thread
Search this Thread:

Advanced Search

Posting Rules
You may not post new threads
You may not post replies
You may not post attachments
You may not edit your posts

BB code is On
Smilies are On
[IMG] code is Off
HTML code is Off



Similar Threads
Thread Thread Starter Forum Replies Last Post
Upgrading to KDE3.4 drumstick SUSE / openSUSE 3 03-22-2005 06:28 PM
Upgrading to KDE3.3.1 in FC2 through yum msie02 Fedora 1 10-26-2004 12:21 PM
sound and font problems after upgrading to kde3.2 true_atlantis Linux - Software 1 04-21-2004 02:28 AM
pls help with upgrading to KDE3.1.1 nomadman Linux - Software 7 02-01-2003 01:20 AM
2 problems after upgrading to KDE3 Sfin Slackware 2 05-09-2002 11:23 PM

LinuxQuestions.org > Forums > Linux Forums > Linux - Software

All times are GMT -5. The time now is 02:44 PM.

Main Menu
Advertisement
My LQ
Write for LQ
LinuxQuestions.org is looking for people interested in writing Editorials, Articles, Reviews, and more. If you'd like to contribute content, let us know.
Main Menu
Syndicate
RSS1  Latest Threads
RSS1  LQ News
Twitter: @linuxquestions
Facebook: linuxquestions Google+: linuxquestions
Open Source Consulting | Domain Registration