LinuxQuestions.org
Welcome to the most active Linux Forum on the web.
Go Back   LinuxQuestions.org > Forums > Linux Forums > Linux - Software
User Name
Password
Linux - Software This forum is for Software issues.
Having a problem installing a new program? Want to know which application is best for the job? Post your question in this forum.

Notices


Reply
  Search this Thread
Old 06-11-2005, 03:26 PM   #1
captain skywave
Member
 
Registered: Nov 2004
Location: Europe
Distribution: WIN8.1 ENT, WIN SERVER 2012 R2, openSUSE 42.1 LEAP
Posts: 118

Rep: Reputation: 15
super karamba install..?


i downloaded superkaramba-0.36.tar.gz

./configure ran ok until the end where it came up with this:

Code:
checking for Qt... 
configure: error: Qt (>= Qt 3.1 (20021021)) (library qt-mt) not found. Please check your installation!
For more details about this problem, look at the end of config.log.
Make sure that you have compiled Qt with thread support!
i have installed all possible qt packages - version 3.3.4-17

what can i do..?
 
Old 06-11-2005, 03:55 PM   #2
prj
Member
 
Registered: Aug 2003
Location: South Wales
Distribution: Kubuntu, Ubuntu server, SuSE 11, Knoppix, Puppy, Myth. Oh alright then, all of them
Posts: 177

Rep: Reputation: 30
Most peculiar - I upgraded to 9.3 from 9.1 and 9.2 with no effect on my Super Karamba main install but did lose the weather!

What did the config.log say?

Do you have the QT3-devel or any of the other QT3 related packages installed?

For info I have: QT3 version 3.3.4-11.3 with the developer packages but no debug packages installed.

A quick read of the dependancies in Yast for the main QT3 and developer packages reveals "libqt-mt.so.3" which I quess is what you might be missing. This should install as part of QT3 by my reckoning. Correct me if I'm wrong here!
 
Old 06-11-2005, 04:20 PM   #3
mkoljack
Member
 
Registered: Jan 2005
Location: Chicago
Distribution: Fedora Core 4, Suse 9.3
Posts: 186

Rep: Reputation: 30
qt3

I installed all qt3 pkgs. via yast. Takes only a minute and not too much disk space. You should then run ./configure again and all will be fine. If you have any further errors during "make", just install the appropriate missings pkgs or post back if there are problems or if you are unsure.
 
Old 06-11-2005, 04:22 PM   #4
captain skywave
Member
 
Registered: Nov 2004
Location: Europe
Distribution: WIN8.1 ENT, WIN SERVER 2012 R2, openSUSE 42.1 LEAP
Posts: 118

Original Poster
Rep: Reputation: 15
Thumbs up

prj

thanx for your quick reply

your comments directed me to check the qt dependencies on my server box (which is the one on which i wanted to install super karamba) btw - it's a 64 bit suse9.3pro version..

this led me to try an install on my laptop - which runs a 32 bit version..

and guess what - it worked on the laptop..!

so i'm now almost sure the karamba does not work on a 64 bit version - at least not to my knowledge..
i'm sure some wizzard can tell me the tweak to do to make it work on a 64 bit box..?

have a good night in South Wales..
 
Old 06-11-2005, 04:34 PM   #5
captain skywave
Member
 
Registered: Nov 2004
Location: Europe
Distribution: WIN8.1 ENT, WIN SERVER 2012 R2, openSUSE 42.1 LEAP
Posts: 118

Original Poster
Rep: Reputation: 15
o - oohh..wait..wait..

while i was writing my last reply - the karamba was full speed ahead doing a 'make' on my laptop - and while i took my eyes off - to write the reply - i did not notice that it was 'screaming' at me in red letters that something is wrong with python..??

now i'll have to try and install more packages and then see if it'll work..

thanx also mkoljack in Chicago..
 
Old 06-11-2005, 04:36 PM   #6
prj
Member
 
Registered: Aug 2003
Location: South Wales
Distribution: Kubuntu, Ubuntu server, SuSE 11, Knoppix, Puppy, Myth. Oh alright then, all of them
Posts: 177

Rep: Reputation: 30
Half a result then!

My boxes are all 32 bit so not experienced with the intricacies of these new fangled 64 bit things.
QT4 RC is here now with QT4 due out at the end of June so that may offer some help.

Good luck with finding a solution.
 
Old 06-11-2005, 04:54 PM   #7
captain skywave
Member
 
Registered: Nov 2004
Location: Europe
Distribution: WIN8.1 ENT, WIN SERVER 2012 R2, openSUSE 42.1 LEAP
Posts: 118

Original Poster
Rep: Reputation: 15
ok guys - i'm almost embarrased to post this output - but after installing absolute all packages from a qt query and a python query in yast - i did another attempt to initiate a 'make' on my 32 bit laptop - and this came out:
(notice the python output - what to make of this..?)

Code:
 # make
make  all-recursive
make[1]: Entering directory `/home/downloads/super.karamba/karamba/superkaramba-0.36/superkaramba-0.36'
Making all in doc
make[2]: Entering directory `/home/downloads/super.karamba/karamba/superkaramba-0.36/superkaramba-0.36/doc'
Making all in .
make[3]: Entering directory `/home/downloads/super.karamba/karamba/superkaramba-0.36/superkaramba-0.36/doc'
make[3]: Nothing to be done for `all-am'.
make[3]: Leaving directory `/home/downloads/super.karamba/karamba/superkaramba-0.36/superkaramba-0.36/doc'
Making all in en
make[3]: Entering directory `/home/downloads/super.karamba/karamba/superkaramba-0.36/superkaramba-0.36/doc/en'
make[3]: Nothing to be done for `all'.
make[3]: Leaving directory `/home/downloads/super.karamba/karamba/superkaramba-0.36/superkaramba-0.36/doc/en'
make[2]: Leaving directory `/home/downloads/super.karamba/karamba/superkaramba-0.36/superkaramba-0.36/doc'
Making all in po
make[2]: Entering directory `/home/downloads/super.karamba/karamba/superkaramba-0.36/superkaramba-0.36/po'
make[2]: Nothing to be done for `all'.
make[2]: Leaving directory `/home/downloads/super.karamba/karamba/superkaramba-0.36/superkaramba-0.36/po'
Making all in src
make[2]: Entering directory `/home/downloads/super.karamba/karamba/superkaramba-0.36/superkaramba-0.36/src'
make[3]: Entering directory `/home/downloads/super.karamba/karamba/superkaramba-0.36/superkaramba-0.36/src'
if g++ -DHAVE_CONFIG_H -I. -I. -I.. -I/opt/kde3/include -I/usr/lib/qt3/include -I/usr/X11R6/include     -DQT_THREAD_SUPPORT  -D_REENTRANT  -Wnon-virtual-dtor -Wno-long-long -Wundef -Wall -W -Wpointer-arith -Wwrite-strings -ansi -D_XOPEN_SOURCE=500 -D_BSD_SOURCE -Wcast-align -Wconversion -Wchar-subscripts -O2 -Wformat-security -Wmissing-format-attribute -fno-exceptions -fno-check-new -fno-common  -MT bar_python.o -MD -MP -MF ".deps/bar_python.Tpo" -c -o bar_python.o bar_python.cpp; \
then mv -f ".deps/bar_python.Tpo" ".deps/bar_python.Po"; else rm -f ".deps/bar_python.Tpo"; exit 1; fi
bar_python.cpp:27:20: Python.h: No such file or directory
In file included from bar_python.cpp:31:
meter_python.h:22: error: `PyObject' was not declared in this scope
meter_python.h:22: error: `text' was not declared in this scope
meter_python.h:23: error: syntax error before `*' token
meter_python.h:25: error: syntax error before `*' token
meter_python.h:26: error: syntax error before `*' token
meter_python.h:27: error: syntax error before `*' token
meter_python.h:28: error: syntax error before `*' token
meter_python.h:29: error: syntax error before `*' token
meter_python.h:30: error: syntax error before `*' token
meter_python.h:31: error: syntax error before `*' token
meter_python.h:32: error: syntax error before `*' token
meter_python.h:33: error: syntax error before `*' token
meter_python.h:34: error: syntax error before `*' token
meter_python.h:35: error: syntax error before `*' token
meter_python.h:36: error: syntax error before `*' token
meter_python.h:37: error: syntax error before `*' token
meter_python.h:38: error: syntax error before `*' token
meter_python.h:39: error: syntax error before `*' token
meter_python.h:40: error: syntax error before `*' token
meter_python.h:41: error: syntax error before `*' token
In file included from bar_python.cpp:32:
bar_python.h:42: error: syntax error before `*' token
bar_python.h:56: error: syntax error before `*' token
bar_python.h:76: error: syntax error before `*' token
bar_python.h:91: error: syntax error before `*' token
bar_python.h:107: error: syntax error before `*' token
bar_python.h:122: error: syntax error before `*' token
bar_python.h:138: error: syntax error before `*' token
bar_python.h:153: error: syntax error before `*' token
bar_python.h:168: error: syntax error before `*' token
bar_python.h:182: error: syntax error before `*' token
bar_python.h:197: error: syntax error before `*' token
bar_python.h:211: error: syntax error before `*' token
bar_python.h:227: error: syntax error before `*' token
bar_python.h:241: error: syntax error before `*' token
bar_python.h:256: error: syntax error before `*' token
bar_python.h:270: error: syntax error before `*' token
bar_python.h:285: error: syntax error before `*' token
bar_python.h:299: error: syntax error before `*' token
bar_python.h:314: error: syntax error before `*' token
bar_python.cpp:34: error: syntax error before `*' token
bar_python.cpp:38: error: syntax error before `if'
bar_python.cpp:43: error: `x' was not declared in this scope
bar_python.cpp:43: error: `y' was not declared in this scope
bar_python.cpp:43: error: `w' was not declared in this scope
bar_python.cpp:43: error: `h' was not declared in this scope
bar_python.cpp:44: error: syntax error before `->' token
bar_python.cpp:47: error: syntax error before `*' token
bar_python.cpp:51: error: syntax error before `*' token
bar_python.cpp:59: error: syntax error before `*' token
bar_python.cpp:64: error: syntax error before `*' token
bar_python.cpp:69: error: syntax error before `*' token
bar_python.cpp:74: error: syntax error before `*' token
bar_python.cpp:79: error: syntax error before `*' token
bar_python.cpp:84: error: syntax error before `*' token
bar_python.cpp:89: error: syntax error before `*' token
bar_python.cpp:94: error: syntax error before `*' token
bar_python.cpp:99: error: syntax error before `*' token
bar_python.cpp:104: error: syntax error before `*' token
bar_python.cpp:109: error: syntax error before `*' token
bar_python.cpp:114: error: syntax error before `*' token
bar_python.cpp:119: error: syntax error before `*' token
bar_python.cpp:124: error: syntax error before `*' token
bar_python.cpp:129: error: syntax error before `*' token
bar_python.cpp:139: error: syntax error before `*' token
bar_python.cpp:143: error: syntax error before `if'
bar_python.cpp:150: error: syntax error before `*' token
bar_python.cpp:160: error: syntax error before `*' token
bar_python.cpp:167: error: syntax error before `*' token
make[3]: *** [bar_python.o] Error 1
make[3]: Leaving directory `/home/downloads/super.karamba/karamba/superkaramba-0.36/superkaramba-0.36/src'
make[2]: *** [all-recursive] Error 1
make[2]: Leaving directory `/home/downloads/super.karamba/karamba/superkaramba-0.36/superkaramba-0.36/src'
make[1]: *** [all-recursive] Error 1
make[1]: Leaving directory `/home/downloads/super.karamba/karamba/superkaramba-0.36/superkaramba-0.36'
make: *** [all] Error 2
travel:/home/downloads/super.karamba/karamba/superkaramba-0.36/superkaramba-0.36 #
 
Old 06-11-2005, 05:08 PM   #8
prj
Member
 
Registered: Aug 2003
Location: South Wales
Distribution: Kubuntu, Ubuntu server, SuSE 11, Knoppix, Puppy, Myth. Oh alright then, all of them
Posts: 177

Rep: Reputation: 30
According to the SuperKaramba site this seems to indicate you need the "python-devel" package installed.

Have a look at SuperKaramba FAQ for more on this.

Edit - just found this on the SuperKaramba forum which might also help.

Last edited by prj; 06-11-2005 at 05:12 PM.
 
Old 06-11-2005, 05:43 PM   #9
captain skywave
Member
 
Registered: Nov 2004
Location: Europe
Distribution: WIN8.1 ENT, WIN SERVER 2012 R2, openSUSE 42.1 LEAP
Posts: 118

Original Poster
Rep: Reputation: 15
prj,

hey - you just gave me the bit of info needed to solve the task for good..

i used your last link for the superkaramba faq..
there is this guy - Sharki - who has a similar prob..
i used this recommodation from Ryan:
Code:
./configure --with-pythondir=/usr/lib/python2.4
..and - i bet you - it worked..!
i now have superkaramba up and running..

thanx again..buddy..
 
  


Reply


Thread Tools Search this Thread
Search this Thread:

Advanced Search

Posting Rules
You may not post new threads
You may not post replies
You may not post attachments
You may not edit your posts

BB code is On
Smilies are On
[IMG] code is Off
HTML code is Off



Similar Threads
Thread Thread Starter Forum Replies Last Post
super karamba install with qt prob captain skywave Linux - Software 5 06-13-2005 02:54 AM
karamba *not super karamba* whishkah Linux - Software 1 09-28-2004 10:59 AM
Super Karamba Help Matt.Ramos Linux - Software 3 07-15-2004 04:38 PM
super karamba JMK Linux - Newbie 2 02-16-2004 05:24 PM
Super Karamba with Mandrake 9.2 deejayqf Mandriva 2 01-30-2004 01:35 AM

LinuxQuestions.org > Forums > Linux Forums > Linux - Software

All times are GMT -5. The time now is 05:53 PM.

Main Menu
Advertisement
My LQ
Write for LQ
LinuxQuestions.org is looking for people interested in writing Editorials, Articles, Reviews, and more. If you'd like to contribute content, let us know.
Main Menu
Syndicate
RSS1  Latest Threads
RSS1  LQ News
Twitter: @linuxquestions
Open Source Consulting | Domain Registration