LinuxQuestions.org
Download your favorite Linux distribution at LQ ISO.
Go Back   LinuxQuestions.org > Forums > Linux Forums > Linux - Software
User Name
Password
Linux - Software This forum is for Software issues.
Having a problem installing a new program? Want to know which application is best for the job? Post your question in this forum.

Notices


Reply
  Search this Thread
Old 10-22-2004, 06:33 AM   #1
_TT_
LQ Newbie
 
Registered: Oct 2004
Posts: 6

Rep: Reputation: 0
rpmbuild of xine error...


I am trying to build an rpm of the xine-lib-1-rc6a.tar.gz file with the following command:
# rpmbuild -ta xine-lib-1-rc6a.tar.gz

After a while I receive the following error message:
Quote:
gcc -DHAVE_CONFIG_H -I. -I. -I../.. -I../.. -I../../include -I../../include -I../../src -I../../src/xine-engine -I../../src/xine-engine -I../../src/xine-utils -I../../src/input -I../../src/input -I/usr/include/libpng12 -DPNG_THREAD_UNSAFE_OK -DPNG_USE_PNGGCCRD -mtune=pentium -O3 -pipe -fomit-frame-pointer -falign-functions=4 -falign-loops=4 -falign-jumps=4 -mpreferred-stack-boundary=2 -fexpensive-optimizations -fschedule-insns2 -fno-strict-aliasing -ffast-math -funroll-loops -finline-functions -Wall -DNDEBUG -D_REENTRANT -D_FILE_OFFSET_BITS=64 -DXINE_COMPILE -Wpointer-arith -Wnested-externs -Wcast-align -Wchar-subscripts -Wmissing-declarations -Wmissing-prototypes -O2 -g -march=i586 -mcpu=i686 -fmessage-length=0 -c image.c -MT xineplug_decode_image_la-image.lo -MD -MP -MF .deps/xineplug_decode_image_la-image.TPlo
mv -f xineplug_decode_image_la-image.o .libs/xineplug_decode_image_la-image.o
mv: cannot stat `xineplug_decode_image_la-image.o': No such file or directory
make[3]: *** [xineplug_decode_image_la-image.lo] Error 1
make[3]: Leaving directory `/usr/src/packages/BUILD/xine-lib-1-rc6a/src/libxinevdec'
make[2]: *** [all-recursive] Error 1
make[2]: Leaving directory `/usr/src/packages/BUILD/xine-lib-1-rc6a/src'
make[1]: *** [all-recursive] Error 1
make[1]: Leaving directory `/usr/src/packages/BUILD/xine-lib-1-rc6a'
make: *** [all] Error 2
error: Bad exit status from /var/tmp/rpm-tmp.30648 (%build)


RPM build errors:
Bad exit status from /var/tmp/rpm-tmp.30648 (%build)
Installing xine from compiling sources works fine.

Is there anyone who can tell me what this error means?
 
  


Reply


Thread Tools Search this Thread
Search this Thread:

Advanced Search

Posting Rules
You may not post new threads
You may not post replies
You may not post attachments
You may not edit your posts

BB code is On
Smilies are On
[IMG] code is Off
HTML code is Off



Similar Threads
Thread Thread Starter Forum Replies Last Post
rpmbuild cpio read error winglin Linux - Software 1 08-25-2007 12:43 AM
Broken Pipe error with rpmbuild in rh9 tuxfood Red Hat 1 05-21-2005 04:30 PM
PLEASE HELP !!! xine error Ritchie00 Linux - Software 1 08-11-2004 05:02 PM
rpmbuild --rebuild qmail-1.03 gets error aggiesoft Red Hat 0 03-02-2004 01:14 PM
error during compiling rpms using rpmbuild jogurt666 Red Hat 4 11-04-2003 06:47 AM

LinuxQuestions.org > Forums > Linux Forums > Linux - Software

All times are GMT -5. The time now is 08:08 AM.

Main Menu
Advertisement
My LQ
Write for LQ
LinuxQuestions.org is looking for people interested in writing Editorials, Articles, Reviews, and more. If you'd like to contribute content, let us know.
Main Menu
Syndicate
RSS1  Latest Threads
RSS1  LQ News
Twitter: @linuxquestions
Facebook: linuxquestions Google+: linuxquestions
Open Source Consulting | Domain Registration