-   Linux - Software (
-   -   Problem compiling esmart (E17 Dependency) (

c_olin3404 08-16-2005 02:23 PM

Problem compiling esmart (E17 Dependency)
I am trying to get Enlightenment 17 working on my Debian box. I downloaded it from CVS and started compiling the dependencies in order. But when I got to esmart I got this error:


0:9:0 esmart_draggies.lo -L/usr/local/lib -levas -lecore -lecore_x -lecore_evas
gcc -shared  .libs/esmart_draggies.o  -Wl,--rpath -Wl,/usr/local/lib -Wl,--rpath -Wl,/usr/local/lib -L/usr/local/lib /usr/local/lib/ /usr/local/lib/ -lecore_x /usr/local/lib/  -Wl,-soname -Wl, -o .libs/
/usr/bin/ld: cannot find -lecore_x
collect2: ld returned 1 exit status
make[4]: *** [] Error 1
make[4]: Leaving directory `/home/colin/e17/libs/esmart/src/lib/esmart_draggies'
make[3]: *** [all-recursive] Error 1
make[3]: Leaving directory `/home/colin/e17/libs/esmart/src/lib'
make[2]: *** [all-recursive] Error 1
make[2]: Leaving directory `/home/colin/e17/libs/esmart/src'
make[1]: *** [all] Error 2
make[1]: Leaving directory `/home/colin/e17/libs/esmart/src'
make: *** [all-recursive] Error 1

Anyone know a way around this?

(Also, is this a good place to ask E17 questions? I tried #e on but it is rather quiet)

SoulMUSZE 09-25-2005 10:20 PM

I'm experiencing the same thing. Anyone found a workaround for this yet?

All times are GMT -5. The time now is 09:50 PM.