LinuxQuestions.org
Visit Jeremy's Blog.
Go Back   LinuxQuestions.org > Forums > Linux Forums > Linux - Software
User Name
Password
Linux - Software This forum is for Software issues.
Having a problem installing a new program? Want to know which application is best for the job? Post your question in this forum.

Notices


Reply
  Search this Thread
Old 11-03-2004, 06:41 AM   #1
jimsons
LQ Newbie
 
Registered: Nov 2004
Posts: 2

Rep: Reputation: 0
making error whit Pango-1.6.0


./configure --prefix=/usr/local
when I make
it happen as follow

...
ftxgdef.h:63: parse error before "FT_Bool"
ftxgdef.h:63: warning: no semicolon at end of struct or union
ftxgdef.h:66: parse error before "GlyphCount"
ftxgdef.h:66: warning: type defaults to `int' in declaration of `GlyphCount'
ftxgdef.h:66: warning: data definition has no type or storage class
ftxgdef.h:69: parse error before '}' token
ftxgdef.h:78: parse error before "FT_Short"
ftxgdef.h:78: warning: no semicolon at end of struct or union
ftxgdef.h:86: parse error before "FT_UShort"
ftxgdef.h:86: warning: no semicolon at end of struct or union
ftxgdef.h:94: parse error before "FT_Short"
ftxgdef.h:94: warning: no semicolon at end of struct or union
ftxgdef.h:96: parse error before '}' token
ftxgdef.h:103: parse error before "FT_UShort"
ftxgdef.h:103: warning: no semicolon at end of struct or union
ftxgdef.h:111: parse error before "FT_UShort"
ftxgdef.h:111: warning: no semicolon at end of struct or union
ftxgdef.h:115: field `cvf1' has incomplete type
ftxgdef.h:116: field `cvf2' has incomplete type
ftxgdef.h:117: field `cvf3' has incomplete type
ftxgdef.h:118: field `cvf4' has incomplete type
ftxgdef.h:120: parse error before '}' token
ftxgdef.h:127: parse error before "FT_Bool"
ftxgdef.h:127: warning: no semicolon at end of struct or union
ftxgdef.h:129: warning: type defaults to `int' in declaration of `CaretCount'
ftxgdef.h:129: warning: data definition has no type or storage class
ftxgdef.h:131: parse error before '}' token
ftxgdef.h:138: parse error before "FT_Bool"
ftxgdef.h:138: warning: no semicolon at end of struct or union
ftxgdef.h:141: parse error before "LigGlyphCount"
ftxgdef.h:141: warning: type defaults to `int' in declaration of `LigGlyphCount'ftxgdef.h:141: warning: data definition has no type or storage class
ftxgdef.h:143: parse error before '}' token
ftxgdef.h:170: parse error before "FT_Memory"
ftxgdef.h:170: warning: no semicolon at end of struct or union
ftxgdef.h:171: warning: type defaults to `int' in declaration of `offset'
ftxgdef.h:171: warning: data definition has no type or storage class
ftxgdef.h:173: parse error before "Version"
ftxgdef.h:173: warning: type defaults to `int' in declaration of `Version'
ftxgdef.h:173: warning: data definition has no type or storage class
ftxgdef.h:178: parse error before "MarkAttachClassDef_offset"
ftxgdef.h:178: warning: type defaults to `int' in declaration of `MarkAttachClassDef_offset'
ftxgdef.h:178: warning: data definition has no type or storage class
ftxgdef.h:181: parse error before "LastGlyph"
ftxgdef.h:181: warning: type defaults to `int' in declaration of `LastGlyph'
ftxgdef.h:181: warning: data definition has no type or storage class
ftxgdef.h:182: parse error before '*' token
ftxgdef.h:182: warning: type defaults to `int' in declaration of `NewGlyphClasses'
ftxgdef.h:182: warning: data definition has no type or storage class
ftxgdef.h:183: parse error before '}' token
ftxgdef.h:195: parse error before "TT_New_GDEF_Table"
ftxgdef.h:196: warning: type defaults to `int' in declaration of `TT_New_GDEF_Table'
ftxgdef.h:196: warning: data definition has no type or storage class
ftxgdef.h:199: parse error before "TT_Load_GDEF_Table"
ftxgdef.h:200: warning: type defaults to `int' in declaration of `TT_Load_GDEF_Table'
ftxgdef.h:200: warning: data definition has no type or storage class
ftxgdef.h:203: parse error before "TT_Done_GDEF_Table"
ftxgdef.h:203: warning: type defaults to `int' in declaration of `TT_Done_GDEF_Table'
ftxgdef.h:203: warning: data definition has no type or storage class
ftxgdef.h:206: parse error before "TT_GDEF_Get_Glyph_Property"
ftxgdef.h:207: parse error before "FT_UShort"
ftxgdef.h:208: warning: type defaults to `int' in declaration of `TT_GDEF_Get_Glyph_Property'
ftxgdef.h:208: warning: data definition has no type or storage class
ftxgdef.h:210: parse error before "TT_GDEF_Build_ClassDefinition"
ftxgdef.h:211: parse error before "FT_UShort"
ftxgdef.h:214: warning: type defaults to `int' in declaration of `TT_GDEF_Build_ClassDefinition'
ftxgdef.h:214: warning: data definition has no type or storage class
In file included from ftxopen.h:287,
from ftxopen.c:18:
ftxgsub.h:56: parse error before '*' token
ftxgsub.h:56: parse error before "pos"
ftxgsub.h:60: warning: type defaults to `int' in declaration of `FT_UShort'
ftxgsub.h:60: `FT_UShort' declared as function returning a function
ftxgsub.h:65: parse error before "FT_Memory"
ftxgsub.h:65: warning: no semicolon at end of struct or union
ftxgsub.h:67: warning: type defaults to `int' in declaration of `offset'
ftxgsub.h:67: warning: data definition has no type or storage class
ftxgsub.h:69: parse error before "Version"
ftxgsub.h:69: warning: type defaults to `int' in declaration of `Version'
ftxgsub.h:69: warning: data definition has no type or storage class
ftxgsub.h:80: parse error before "altfunc"
ftxgsub.h:80: warning: type defaults to `int' in declaration of `altfunc'
ftxgsub.h:80: warning: data definition has no type or storage class
ftxgsub.h:81: conflicting types for `data'
/usr/include/freetype2/freetype/freetype.h:1635: previous declaration of `data'
ftxgsub.h:82: parse error before '}' token
ftxgsub.h:92: parse error before "FT_Short"
ftxgsub.h:92: warning: no semicolon at end of struct or union
ftxgsub.h:101: field `GlyphCount' declared as a function
ftxgsub.h:111: field `SubstFormat' declared as a function
ftxgsub.h:112: field `Coverage' has incomplete type
ftxgsub.h:116: field `ssf1' has incomplete type
ftxgsub.h:119: confused by earlier errors, bailing out
make[4]: *** [ftxopen.lo] error 1
make[4]: Leaving directory `/home/software/gtk/pango-1.6.0/pango/opentype'
make[3]: *** [all-recursive] error 1
make[3]: Leaving directory `/home/software/gtk/pango-1.6.0/pango'
make[2]: *** [all] error 2
make[2]: Leaving directory `/home/software/gtk/pango-1.6.0/pango'
make[1]: *** [all-recursive] error 1
make[1]: Leaving directory `/home/software/gtk/pango-1.6.0'
make: *** [all] error 2

can any one help me
 
Old 11-04-2004, 09:23 AM   #2
jimsons
LQ Newbie
 
Registered: Nov 2004
Posts: 2

Original Poster
Rep: Reputation: 0
help
 
  


Reply


Thread Tools Search this Thread
Search this Thread:

Advanced Search

Posting Rules
You may not post new threads
You may not post replies
You may not post attachments
You may not edit your posts

BB code is On
Smilies are On
[IMG] code is Off
HTML code is Off



Similar Threads
Thread Thread Starter Forum Replies Last Post
error in the creation of `etc/pango/pango.modules` okeyla Linux - Newbie 3 07-02-2011 09:06 PM
I've got the making pango blues. Darkenedes Linux - Software 10 05-20-2005 11:08 PM
Pango Building Error lasindi Linux - Software 1 06-14-2004 03:35 AM
Please Help! Pango install error while making Spud_Hed Linux - Software 1 05-17-2004 02:11 PM
Making autologin whit out KDE little_ball Slackware 13 04-01-2004 12:49 PM

LinuxQuestions.org > Forums > Linux Forums > Linux - Software

All times are GMT -5. The time now is 10:57 PM.

Main Menu
Advertisement
My LQ
Write for LQ
LinuxQuestions.org is looking for people interested in writing Editorials, Articles, Reviews, and more. If you'd like to contribute content, let us know.
Main Menu
Syndicate
RSS1  Latest Threads
RSS1  LQ News
Twitter: @linuxquestions
Open Source Consulting | Domain Registration