-   Linux - Software (
-   -   konstruct error collect2: ld returned 1 exit status (

X2O 08-10-2004 09:53 AM

konstruct error collect2: ld returned 1 exit status
I am trying to build KDE 3.2.3 using konstruct on Mandrake 9.2 but half way I got the following error...

help pleasee....

/bin/sh ../../libtool --silent --mode=link --tag=CXX g++ -Wnon-virtual-dtor -Wno-long-long -Wundef -ansi -D_XOPEN_SOURCE=500 -D_BSD_SOURCE -Wcast-align -Wconversion -Wchar-subscripts -Wall -W -Wpointer-arith -Wwrite-strings -O2 -I/root/kde3.2.3/include -I/usr/X11R6/include -L/root/kde3.2.3/lib -L/usr/X11R6/lib -O2 -pipe -I/root/kde3.2.3/include -I/usr/X11R6/include -L/root/kde3.2.3/lib -L/usr/X11R6/lib -O2 -pipe -I/root/kde3.2.3/include -I/usr/X11R6/include -L/root/kde3.2.3/lib -L/usr/X11R6/lib -O2 -pipe -Wformat-security -Wmissing-format-attribute -fno-exceptions -fno-check-new -fno-common -DQT_CLEAN_NAMESPACE -DQT_NO_ASCII_CAST -DQT_NO_STL -DQT_NO_COMPAT -DQT_NO_TRANSLATION -L/root/kde3.2.3/lib -L/usr/X11R6/lib -L/root/kde3.2.3/lib -L/usr/X11R6/lib -L/root/kde3.2.3/lib -L/usr/X11R6/lib -o kio_uiserver -R /root/kde3.2.3/lib -R /root/kde3.2.3/lib -R /usr/X11R6/lib -no-undefined -L/usr/X11R6/lib -L/root/kde3.2.3/lib
./.libs/ undefined reference to `UIServer::SetItemVisible(ProgressItem*, bool)'
collect2: ld returned 1 exit status
make[7]: *** [kio_uiserver] Error 1
make[7]: Leaving directory `/home/roy/konstruct/kde/kdelibs/work/kdelibs-3.2.3/kio/misc'
make[6]: *** [all-recursive] Error 1
make[6]: Leaving directory `/home/roy/konstruct/kde/kdelibs/work/kdelibs-3.2.3/kio/misc'
make[5]: *** [all-recursive] Error 1
make[5]: Leaving directory `/home/roy/konstruct/kde/kdelibs/work/kdelibs-3.2.3/kio'
make[4]: *** [all-recursive] Error 1
make[4]: Leaving directory `/home/roy/konstruct/kde/kdelibs/work/kdelibs-3.2.3'
make[3]: *** [all] Error 2
make[3]: Leaving directory `/home/roy/konstruct/kde/kdelibs/work/kdelibs-3.2.3'
make[2]: *** [build-work/kdelibs-3.2.3/Makefile] Error 2
make[2]: Leaving directory `/home/roy/konstruct/kde/kdelibs'
make[1]: *** [dep-../../kde/kdelibs] Error 2
make[1]: Leaving directory `/home/roy/konstruct/kde/kdebase'
make: *** [dep-../../kde/kdebase] Error 2


320mb 08-10-2004 01:50 PM

I don't use programs like konstruct, but I have compiled KDE 3.2.3 from source for my LFS box............Any new version of KDE needs Qt to be updated.........after installing Qt then comes aRts, then kdelibs then that order.........

this is your error
Code: undefined reference to `UIServer::SetItemVisible(ProgressItem*, bool)'
I did a google but got way too many hits to be sure what to tell you......your just gonna have to do some research on your own.........

X2O 08-11-2004 08:48 PM

I tried to post the search in the google but it returned me no result.

Is there any other way to update the KDE? with the RPMs maybe?


All times are GMT -5. The time now is 12:41 PM.