Visit Jeremy's Blog.
Go Back > Forums > Linux Forums > Linux - Software
User Name
Linux - Software This forum is for Software issues.
Having a problem installing a new program? Want to know which application is best for the job? Post your question in this forum.


  Search this Thread
Old 08-11-2003, 07:37 AM   #1
LQ Newbie
Registered: Aug 2003
Distribution: Mandrake 9.1
Posts: 4

Rep: Reputation: 0
Kinkatta compile error in awayOptions

I am trying to install Kinkatta 1.01 on Mandrake 9.1. I installed Qt 3.2.0 from TrollTech. Built and compiled it successfully. The configure script on Kinkatta was successful once Qt was installed. When I tried to make Kinkatta It worked for awhile then spewed out this error:

awayoptions.cpp: In method `awayOptions::awayOptions(QWidget * = 0, const char * = 0, unsigned int = 0)':
awayoptions.cpp:83: no matching function for call to `QCheckBox::setAutoResize (const bool &)'
make[3]: *** [awayoptions.lo] Error 1
make[3]: Leaving directory `/root/install/kinkatta-1.01/kinkatta/options'
make[2]: *** [all-recursive] Error 1
make[2]: Leaving directory `/root/install/kinkatta-1.01/kinkatta'
make[1]: *** [all-recursive] Error 1
make[1]: Leaving directory `/root/install/kinkatta-1.01'
make: *** [all-recursive-am] Error 2

In another thread here someone suggested downgrading my compiler. I really don't want to do that and wondered why you would have too? Also, is their another way?

I am running Mandrake 9.1, Qt 3.2.0, KDE 3.1. I was able to compile KvIRC that also requires Qt so I'm pretty sure I have installed Qt correctly.

From the screenshots this client looks nice and I'd like to use an AIM that supports the KDE dock.

Thanks! Jason


Thread Tools Search this Thread
Search this Thread:

Advanced Search

Posting Rules
You may not post new threads
You may not post replies
You may not post attachments
You may not edit your posts

BB code is On
Smilies are On
[IMG] code is Off
HTML code is Off

Similar Threads
Thread Thread Starter Forum Replies Last Post
I've got an error while compile kawdk Linux - Software 0 05-16-2004 04:13 AM
compile error with 2.6.5 jamaas Linux - Newbie 6 04-17-2004 02:11 AM
compile error: #error unknown processor family kmack2001 Linux - Newbie 0 02-14-2004 12:52 PM
Alsa compile error, and a WINE error scheidel21 Linux - Software 1 12-08-2003 09:16 PM
kinkatta error on startup dchoe Linux - Software 0 04-17-2003 11:53 PM > Forums > Linux Forums > Linux - Software

All times are GMT -5. The time now is 12:35 AM.

Main Menu
Write for LQ is looking for people interested in writing Editorials, Articles, Reviews, and more. If you'd like to contribute content, let us know.
Main Menu
RSS1  Latest Threads
RSS1  LQ News
Twitter: @linuxquestions
Open Source Consulting | Domain Registration