-   Linux - Software (
-   -   installing karamba issues (

yellowdogbrandn 08-14-2003 06:25 PM

installing karamba issues
K I am a serious linux newb and I have (sorta) been able to figure out every problem I've had but this one has me staring at the screen I don't know what is wront

I have recently seen a screen shot of karamba and I am in looooooove ;)

so I get everything it tells me to get and everything installs and goes great until i go to install karamba

I start compiling and the configure goes fine and it says everything is good, begin make.

make install starts and this is what i get

karamba.moc:150: `karambaRun' undeclared (first use this function)
make[2]: *** [karamba.o] Error 1
make[2]: Leaving directory `/home/brandon/src'
make[1]: *** [install-recursive] Error 1
make[1]: Leaving directory `/home/brandon/src'
make: *** [install-recursive] Error 1

god I hope the answer isnt staring me right in the face but make fun of me if you will as long as you give me the answer I can bare it ;).

Please I wanna see karambaaaaa

P.S. I am running Yellow Dog on a macintosh powerbook g3 lombard if this has anything to do with it. Is karamba intel only??

parnal 10-09-2003 06:32 PM

after you ran the .configure script, I guess you ran the "make" and after that the "make install" ah? Did you?
Did the "make" command finished wiht exit code = 0, or someone else?
If not, look in the error messages above. You will only get the app running with "make install" if the "make" finishes whit exit code = 0 (that means a sucssesfully compiling)
C ya!

All times are GMT -5. The time now is 10:33 AM.