Help answer threads with 0 replies.
Go Back > Forums > Linux Forums > Linux - Software
User Name
Linux - Software This forum is for Software issues.
Having a problem installing a new program? Want to know which application is best for the job? Post your question in this forum.


  Search this Thread
Old 11-21-2004, 12:27 PM   #1
LQ Newbie
Registered: Nov 2004
Posts: 6

Rep: Reputation: 0
Error building kdevelop


I'm using Gentoo (KDE 3.3) on an AMD 64 machine. I try do download/build/install kdevelop, but I have encountered some problems.

I use "emerge dev-util/kdevelop". After quite a while of downloading and building (actually when the last package is handled) I get the following errors:

mainwindow.cpp:209:2: warning: #warning this crashes in ideal mode, looks like there are dangling pointers on opening another project
mainwindow.cpp: In constructor `MainWindow::MainWindow(QWidget*, const char*)':
mainwindow.cpp:250: warning: `setIDEAlModeStyle' is deprecated (declared at
mainwindow.cpp: In member function `void MainWindow::createStatusBar()':
mainwindow.cpp:349: error: parse error before `(' token
mainwindow.cpp: In member function `virtual void
MainWindow::embedSelectView(QWidget*, const QString&, const QString&)':
mainwindow.cpp:510: warning: unused variable `KMdiToolViewAccessor*tmp'
mainwindow.cpp: In member function `virtual void
MainWindow::embedSelectViewRight(QWidget*, const QString&, const QString&)':
mainwindow.cpp:542: warning: unused variable `KMdiToolViewAccessor*tmp'
mainwindow.cpp: In member function `virtual void
MainWindow::embedOutputView(QWidget*, const QString&, const QString&)':
mainwindow.cpp:558: warning: unused variable `KMdiToolViewAccessor*tmp'
mainwindow.cpp: In member function `virtual void
mainwindow.cpp:647: warning: unused variable `QPtrList<QWidget>*pViews'
make[3]: *** [mainwindow.o] Error 1
make[3]: *** Waiting for unfinished jobs....
make[3]: Leaving directory `/var/tmp/portage/kdevelop-3.0.4/work/kdevelop-3.0.4/src'
make[2]: *** [all-recursive] Error 1
make[2]: Leaving directory `/var/tmp/portage/kdevelop-3.0.4/work/kdevelop-3.0.4/src'
make[1]: *** [all-recursive] Error 1
make[1]: Leaving directory `/var/tmp/portage/kdevelop-3.0.4/work/kdevelop-3.0.4'
make: *** [all] Error 2

Any ideas?

Old 11-22-2004, 08:37 PM   #2
Registered: Oct 2003
Distribution: Gentoo, Mint, Ubuntu, Vector
Posts: 174

Rep: Reputation: 17
You should probably watch the status over at the gentoo bug forum...

It seems that is is a 64 bit problem... This is where I would look.

Why not use kdevelop 3.1.1 instead?? Or is there no 64 bit version yet?




Thread Tools Search this Thread
Search this Thread:

Advanced Search

Posting Rules
You may not post new threads
You may not post replies
You may not post attachments
You may not edit your posts

BB code is On
Smilies are On
[IMG] code is Off
HTML code is Off

Similar Threads
Thread Thread Starter Forum Replies Last Post
Kdevelop Makefile Error Chryzmo Programming 4 08-22-2010 04:19 PM
Error With KDevelop John_Emad Programming 11 04-14-2005 07:00 PM
kdevelop error on MDK 10 jemp Linux - Software 1 06-19-2004 10:11 AM
kdevelop: not jumping to error location when clicking on error. sudheernair Linux - Software 0 05-13-2004 08:41 AM
Kdevelop 2.15, QT error paulten Linux - Software 2 03-10-2003 04:54 PM > Forums > Linux Forums > Linux - Software

All times are GMT -5. The time now is 04:36 PM.

Main Menu
Write for LQ is looking for people interested in writing Editorials, Articles, Reviews, and more. If you'd like to contribute content, let us know.
Main Menu
RSS1  Latest Threads
RSS1  LQ News
Twitter: @linuxquestions
Open Source Consulting | Domain Registration