-   Linux - Software (
-   -   Error building kdevelop (

danielg 11-21-2004 12:27 PM

Error building kdevelop

I'm using Gentoo (KDE 3.3) on an AMD 64 machine. I try do download/build/install kdevelop, but I have encountered some problems.

I use "emerge dev-util/kdevelop". After quite a while of downloading and building (actually when the last package is handled) I get the following errors:

mainwindow.cpp:209:2: warning: #warning this crashes in ideal mode, looks like there are dangling pointers on opening another project
mainwindow.cpp: In constructor `MainWindow::MainWindow(QWidget*, const char*)':
mainwindow.cpp:250: warning: `setIDEAlModeStyle' is deprecated (declared at
mainwindow.cpp: In member function `void MainWindow::createStatusBar()':
mainwindow.cpp:349: error: parse error before `(' token
mainwindow.cpp: In member function `virtual void
MainWindow::embedSelectView(QWidget*, const QString&, const QString&)':
mainwindow.cpp:510: warning: unused variable `KMdiToolViewAccessor*tmp'
mainwindow.cpp: In member function `virtual void
MainWindow::embedSelectViewRight(QWidget*, const QString&, const QString&)':
mainwindow.cpp:542: warning: unused variable `KMdiToolViewAccessor*tmp'
mainwindow.cpp: In member function `virtual void
MainWindow::embedOutputView(QWidget*, const QString&, const QString&)':
mainwindow.cpp:558: warning: unused variable `KMdiToolViewAccessor*tmp'
mainwindow.cpp: In member function `virtual void
mainwindow.cpp:647: warning: unused variable `QPtrList<QWidget>*pViews'
make[3]: *** [mainwindow.o] Error 1
make[3]: *** Waiting for unfinished jobs....
make[3]: Leaving directory `/var/tmp/portage/kdevelop-3.0.4/work/kdevelop-3.0.4/src'
make[2]: *** [all-recursive] Error 1
make[2]: Leaving directory `/var/tmp/portage/kdevelop-3.0.4/work/kdevelop-3.0.4/src'
make[1]: *** [all-recursive] Error 1
make[1]: Leaving directory `/var/tmp/portage/kdevelop-3.0.4/work/kdevelop-3.0.4'
make: *** [all] Error 2

Any ideas?


Gary987 11-22-2004 08:37 PM

You should probably watch the status over at the gentoo bug forum...

It seems that is is a 64 bit problem... This is where I would look.

Why not use kdevelop 3.1.1 instead?? Or is there no 64 bit version yet?



All times are GMT -5. The time now is 01:13 PM.