LinuxQuestions.org
Welcome to the most active Linux Forum on the web.
Go Back   LinuxQuestions.org > Forums > Linux Forums > Linux - Software
User Name
Password
Linux - Software This forum is for Software issues.
Having a problem installing a new program? Want to know which application is best for the job? Post your question in this forum.

Notices


Reply
  Search this Thread
Old 08-15-2006, 06:11 PM   #1
android6011
Member
 
Registered: May 2005
Posts: 255

Rep: Reputation: 30
amap "make" error


root@tty1:/tmp/amap-4.8# make
cd pcre-3.9 && make
make[1]: Entering directory `/tmp/amap-4.8/pcre-3.9'
make[1]: Leaving directory `/tmp/amap-4.8/pcre-3.9'

gcc -O2 -o amap amap.c -lpcre -L./pcre-3.9/ -I./pcre-3.9/
amap.c: In function 'read_file_triggers':
amap.c:427: error: invalid lvalue in assignment
amap.c:444: error: invalid lvalue in assignment
amap.c: In function 'read_file_responses':
amap.c:602: error: invalid lvalue in assignment
amap.c:612: error: invalid lvalue in assignment
amap.c:647: error: invalid lvalue in assignment
amap.c:659: error: invalid lvalue in assignment
amap.c: In function 'amap_add_port_string':
amap.c:731: error: invalid lvalue in assignment
amap.c: In function 'read_file_nmap':
amap.c:759: error: invalid lvalue in assignment
amap.c:771: error: invalid lvalue in assignment
amap.c:812: error: invalid lvalue in assignment
amap.c: In function 'amap_add_id':
amap.c:1027: error: invalid lvalue in assignment
amap.c: In function 'amap_scan':
amap.c:1768: error: invalid lvalue in assignment
amap.c: In function 'main':
amap.c:2060: error: invalid lvalue in assignment
amap.c:2101: error: invalid lvalue in assignment
amap.c:2113: error: invalid lvalue in assignment
amap.c:2128: error: invalid lvalue in assignment
amap.c:2158: error: invalid lvalue in assignment
make: *** [amap] Error 1
 
Old 08-15-2006, 07:21 PM   #2
android6011
Member
 
Registered: May 2005
Posts: 255

Original Poster
Rep: Reputation: 30
no ideas anyone?
 
  


Reply


Thread Tools Search this Thread
Search this Thread:

Advanced Search

Posting Rules
You may not post new threads
You may not post replies
You may not post attachments
You may not edit your posts

BB code is On
Smilies are On
[IMG] code is Off
HTML code is Off



Similar Threads
Thread Thread Starter Forum Replies Last Post
get this error when runnign make ***** "no rule to make target 'config'. stop" procfs Linux - General 4 05-12-2013 10:25 AM
General question while running make "make[2]: *** [main.o] Error 1" matazar42 Linux - Software 3 08-15-2005 12:39 PM
error running "make" and "arkollonrc"... Toro Linux - Software 1 04-19-2004 12:24 AM
help with "make" error "Missing seperator" hrishikesh Linux - Software 1 07-18-2003 01:40 AM
LFS 4.1: Stalled at Perl, "missing seperator" error from "make" SparceMatrix Linux From Scratch 1 06-07-2003 03:31 PM

LinuxQuestions.org > Forums > Linux Forums > Linux - Software

All times are GMT -5. The time now is 11:34 AM.

Main Menu
Advertisement
My LQ
Write for LQ
LinuxQuestions.org is looking for people interested in writing Editorials, Articles, Reviews, and more. If you'd like to contribute content, let us know.
Main Menu
Syndicate
RSS1  Latest Threads
RSS1  LQ News
Twitter: @linuxquestions
Open Source Consulting | Domain Registration