LinuxQuestions.org
Share your knowledge at the LQ Wiki.
Go Back   LinuxQuestions.org > Forums > Linux Forums > Linux - Security
User Name
Password
Linux - Security This forum is for all security related questions.
Questions, tips, system compromises, firewalls, etc. are all included here.

Notices


Reply
  Search this Thread
Old 11-24-2004, 04:38 PM   #1
rsharma2000
LQ Newbie
 
Registered: Nov 2004
Posts: 2

Rep: Reputation: 0
xprobe2 "make" error make[1]: *** [config_set.o] Error 1


Hi Folks,

I get the following error when I try to make xprobe2. I have enabled debug on the make to get more info. Any help on how to resolve this would be greatly appreciated. I am using SuSe 9.0 and running the following:
2.4.21-243-default.

The following is the error I get (I have pasted only the last part of the make since I didn't want to inundate you with too much info. Thanks again,


config_set.cc: In member function `int Config_Section::read_sec()':
config_set.cc:162: error: stray '\' in program
config_set.cc:162:25: missing terminating " character
config_set.cc:162: error: `i' undeclared (first use this function)
config_set.cc:162: error: (Each undeclared identifier is reported only once for
each function it appears in.)
config_set.cc:162: error: parse error before string constant
Got a SIGCHLD; 1 unreaped children.
Reaping losing child 0x080785d8 PID 5709
make[1]: *** [config_set.o] Error 1
Removing child 0x080785d8 PID 5709 from chain.
make[1]: Leaving directory `/home/rsharma/Documents/xprobe2-0.2/src'
Got a SIGCHLD; 1 unreaped children.
Reaping losing child 0x08077180 PID 5705
make: *** [all] Error 2
Removing child 0x08077180 PID 5705 from chain.
 
Old 11-24-2004, 05:10 PM   #2
rsharma2000
LQ Newbie
 
Registered: Nov 2004
Posts: 2

Original Poster
Rep: Reputation: 0
The version I'm trying to install is xprobe2-0.2
 
  


Reply


Thread Tools Search this Thread
Search this Thread:

Advanced Search

Posting Rules
You may not post new threads
You may not post replies
You may not post attachments
You may not edit your posts

BB code is On
Smilies are On
[IMG] code is Off
HTML code is Off



Similar Threads
Thread Thread Starter Forum Replies Last Post
General question while running make "make[2]: *** [main.o] Error 1" matazar42 Linux - Software 3 08-15-2005 01:39 PM
Error "make: *** No rule to make target `install'. Stop." help Ohmn Mandriva 8 07-02-2004 08:02 PM
error running "make" and "arkollonrc"... Toro Linux - Software 1 04-19-2004 01:24 AM
help with "make" error "Missing seperator" hrishikesh Linux - Software 1 07-18-2003 02:40 AM
LFS 4.1: Stalled at Perl, "missing seperator" error from "make" SparceMatrix Linux From Scratch 1 06-07-2003 04:31 PM

LinuxQuestions.org > Forums > Linux Forums > Linux - Security

All times are GMT -5. The time now is 06:34 PM.

Main Menu
Advertisement
My LQ
Write for LQ
LinuxQuestions.org is looking for people interested in writing Editorials, Articles, Reviews, and more. If you'd like to contribute content, let us know.
Main Menu
Syndicate
RSS1  Latest Threads
RSS1  LQ News
Twitter: @linuxquestions
Facebook: linuxquestions Google+: linuxquestions
Open Source Consulting | Domain Registration