Help answer threads with 0 replies.
Go Back > Forums > Linux Forums > Linux - Newbie
User Name
Linux - Newbie This Linux forum is for members that are new to Linux.
Just starting out and have a question? If it is not in the man pages or the how-to's this is the place!


  Search this Thread
Old 04-03-2004, 02:16 PM   #1
Registered: Feb 2004
Location: Canada
Distribution: GNU/Linux Debian (Etch)
Posts: 319

Rep: Reputation: 30
Please Help With Installation Error.

Hello i am installing a application called "apollon". It seems to be looking for a file that isn't there but as far as I am concered it is there. I am running Fedora Core 1.

-c -o ktabbar.o `test -f 'ktabbar.cpp' || echo './'`ktabbar.cpp; \
then mv -f ".deps/ktabbar.Tpo" ".deps/ktabbar.Po"; \
else rm -f ".deps/ktabbar.Tpo"; exit 1; \
ktabbar.cpp:168:2: warning: #warning is a GCC extension
ktabbar.cpp:168:2: warning: #warning "Workaround for Qt 3.2.0, 3.2.1 bug"
ktabbar.cpp: In member function `virtual void KTabBar:aintLabel(QPainter*,
const QRect&, QTab*, bool) const':
ktabbar.cpp:330: `PM_TabBarTabShiftHorizontal' is not a member of type `QStyle'
ktabbar.cpp:331: `PM_TabBarTabShiftVertical' is not a member of type `QStyle'
make[3]: *** [ktabbar.o] Error 1
make[3]: Leaving directory `/home/sneakers/Apollon/apollon-dist/apollon-0.9.3/apollon'
make[2]: *** [all-recursive] Error 1
make[2]: Leaving directory `/home/sneakers/Apollon/apollon-dist/apollon-0.9.3/apollon'
make[1]: *** [all-recursive] Error 1
make[1]: Leaving directory `/home/sneakers/Apollon/apollon-dist/apollon-0.9.3'
make: *** [all] Error 2

if you are able to help out that would be great, cheers.
Old 04-04-2004, 12:02 AM   #2
Senior Member
Registered: Nov 2002
Location: pikes peak
Distribution: Slackware, LFS
Posts: 2,577

Rep: Reputation: 48
ktabbar.cpp:330: `PM_TabBarTabShiftHorizontal' is not a member of type `QStyle'
ktabbar.cpp:331: `PM_TabBarTabShiftVertical' is not a member of type `QStyle'
open that .cpp file in your text editor and change the $PATH it is using, point the $PATH to the location of the file it is looking for........


Thread Tools Search this Thread
Search this Thread:

Advanced Search

Posting Rules
You may not post new threads
You may not post replies
You may not post attachments
You may not edit your posts

BB code is On
Smilies are On
[IMG] code is Off
HTML code is Off

Similar Threads
Thread Thread Starter Forum Replies Last Post
Error 219. Error running jifyboot during installation jfi Linspire/Freespire 10 12-14-2004 10:49 AM
mdk 8.2 installation error - ext2fs error hOOPSta Mandriva 0 12-24-2003 08:02 AM
DHCP Installation Error: Dependency Error rhonneil Linux - Networking 2 09-15-2003 06:56 AM
mysql installation error (make install error) jolly_good2000 Linux - Software 1 11-14-2002 05:00 PM
installation error: Error mounting sda1: Invalid Argument sadirmata Linux - Newbie 1 01-29-2002 03:28 AM > Forums > Linux Forums > Linux - Newbie

All times are GMT -5. The time now is 04:20 PM.

Main Menu
Write for LQ is looking for people interested in writing Editorials, Articles, Reviews, and more. If you'd like to contribute content, let us know.
Main Menu
RSS1  Latest Threads
RSS1  LQ News
Twitter: @linuxquestions
Facebook: linuxquestions Google+: linuxquestions
Open Source Consulting | Domain Registration