LinuxQuestions.org
Review your favorite Linux distribution.
Go Back   LinuxQuestions.org > Forums > Linux Forums > Linux - Newbie
User Name
Password
Linux - Newbie This Linux forum is for members that are new to Linux.
Just starting out and have a question? If it is not in the man pages or the how-to's this is the place!

Notices


Reply
  Search this Thread
Old 06-15-2005, 09:58 AM   #1
bloodmist
LQ Newbie
 
Registered: Jun 2005
Posts: 7

Rep: Reputation: 0
ImLib2 help...


I want to compile and install....eterm, and PyPanel.
when I try to compile them , eterm says that it cannot connect to the imlib2 and pypanel shows a lot of error messages with imlib in them.
I have installed imlib2 but still neither of them notices it...

what do I do?
 
Old 06-15-2005, 10:00 AM   #2
Boby
Member
 
Registered: Feb 2004
Location: Sighisoara/Cluj-Napoca (Romania)
Distribution: CentOS 4, Fedora Core 6
Posts: 781

Rep: Reputation: 32
Can you tell us what distribution you are using and the error messages?

Boby
 
Old 06-15-2005, 10:19 AM   #3
bloodmist
LQ Newbie
 
Registered: Jun 2005
Posts: 7

Original Poster
Rep: Reputation: 0
oh.... compleetely forgot..
SuSe 9.3

eterm:
checking for imlib_create_image in -lImlib2... no
configure: warning: *** Pixmap support has been disabled because Imlib2 was not found ***

but it doesnt stop there.... it stops because it can't find some libAST ....yast says that it is installed but eterm can't find it...

and PyPanel:
ppmodule.c:24:20: Imlib2.h: No such file or directory
ppmodule.c: In function `_ppicon':
ppmodule.c:146: error: `Imlib_Image' undeclared (first use in this function)
ppmodule.c:146: error: (Each undeclared identifier is reported only once
ppmodule.c:146: error: for each function it appears in.)
ppmodule.c:146: error: syntax error before "icon"
ppmodule.c:160: error: `icon' undeclared (first use in this function)
ppmodule.c:160: warning: implicit declaration of function `imlib_load_image'
ppmodule.c:163: warning: implicit declaration of function `imlib_create_image_using_data'
ppmodule.c:163: error: `DATA32' undeclared (first use in this function)
ppmodule.c:163: error: syntax error before ')' token
ppmodule.c:167: warning: implicit declaration of function `imlib_context_set_drawable'
ppmodule.c:168: warning: implicit declaration of function `imlib_context_set_colormap'
ppmodule.c:169: warning: implicit declaration of function `imlib_create_image_from_drawable'
ppmodule.c: At top level:
ppmodule.c:172: error: syntax error before "else"
ppmodule.c:179: warning: type defaults to `int' in declaration of `imlib_context_set_image'
ppmodule.c:179: warning: parameter names (without types) in function declaration
ppmodule.c:179: warning: data definition has no type or storage class
ppmodule.c:180: error: syntax error before numeric constant
ppmodule.c:180: warning: type defaults to `int' in declaration of `imlib_image_set_has_alpha'
ppmodule.c:180: warning: data definition has no type or storage class
ppmodule.c:181: warning: type defaults to `int' in declaration of `imlib_context_set_drawable'
ppmodule.c:181: warning: parameter names (without types) in function declaration
ppmodule.c:181: warning: data definition has no type or storage class
ppmodule.c:182: error: syntax error before numeric constant
ppmodule.c:182: warning: type defaults to `int' in declaration of `imlib_context_set_blend'
ppmodule.c:182: warning: data definition has no type or storage class
ppmodule.c:183: warning: type defaults to `int' in declaration of `imlib_render_image_on_drawable_at_size'
ppmodule.c:183: warning: parameter names (without types) in function declaration
ppmodule.c:183: warning: data definition has no type or storage class
ppmodule.c:184: warning: type defaults to `int' in declaration of `imlib_free_image'
ppmodule.c:184: warning: data definition has no type or storage class
ppmodule.c:185: error: syntax error before "return"
ppmodule.c: In function `_ppshade':
ppmodule.c:191: error: `Imlib_Image' undeclared (first use in this function)
ppmodule.c:191: error: syntax error before "bg"
ppmodule.c:212: error: `bg' undeclared (first use in this function)
ppmodule.c:222: warning: implicit declaration of function `imlib_apply_filter'
ppmodule.c:223: warning: implicit declaration of function `imlib_render_pixmaps_for_whole_image'
ppmodule.c:225: warning: implicit declaration of function `imlib_free_pixmap_and_mask'
ppmodule.c: In function `_ppinit':
ppmodule.c:249: warning: implicit declaration of function `imlib_context_set_display'
ppmodule.c:250: warning: implicit declaration of function `imlib_context_set_visual'
ppmodule.c:252: warning: implicit declaration of function `imlib_context_set_dither'
error: command 'gcc' failed with exit status 1

and also giblib...
(not the full list of warnings and errors..)

gib_imlib.c:511: warning: implicit declaration of function `imlib_save_image'
gib_imlib.c: At top level:
gib_imlib.c:515: error: syntax error before "im"
gib_imlib.c: In function `gib_imlib_save_image_with_error_return':
gib_imlib.c:520: error: `im' undeclared (first use in this function)
gib_imlib.c:521: error: `file' undeclared (first use in this function)
gib_imlib.c:524: warning: implicit declaration of function `imlib_save_image_with_error_return'
gib_imlib.c:524: error: `error_return' undeclared (first use in this function)
gib_imlib.c: At top level:
gib_imlib.c:528: error: syntax error before "fn"
gib_imlib.c: In function `gib_imlib_free_font':
gib_imlib.c:530: error: `fn' undeclared (first use in this function)
gib_imlib.c:531: warning: implicit declaration of function `imlib_free_font'
gib_imlib.c: At top level:
gib_imlib.c:535: error: syntax error before "im"
gib_imlib.c: In function `gib_imlib_image_draw_line':
gib_imlib.c:538: error: `im' undeclared (first use in this function)
gib_imlib.c:539: error: `r' undeclared (first use in this function)
gib_imlib.c:539: error: `g' undeclared (first use in this function)
gib_imlib.c:539: error: `b' undeclared (first use in this function)
gib_imlib.c:539: error: `a' undeclared (first use in this function)
gib_imlib.c:540: warning: implicit declaration of function `imlib_image_draw_line'
gib_imlib.c:540: error: `x1' undeclared (first use in this function)
gib_imlib.c:540: error: `y1' undeclared (first use in this function)
gib_imlib.c:540: error: `x2' undeclared (first use in this function)
gib_imlib.c:540: error: `y2' undeclared (first use in this function)
gib_imlib.c:540: error: `make_updates' undeclared (first use in this function)
gib_imlib.c: At top level:
gib_imlib.c:543: error: syntax error before "gib_imlib_create_rotated_image"
gib_imlib.c:543: error: syntax error before "im"
gib_imlib.c:544: warning: return type defaults to `int'
gib_imlib.c: In function `gib_imlib_create_rotated_image':
gib_imlib.c:545: error: `im' undeclared (first use in this function)
gib_imlib.c:546: error: `angle' undeclared (first use in this function)
gib_imlib.c: At top level:
gib_imlib.c:550: error: syntax error before "im"
gib_imlib.c: In function `gib_imlib_image_tile':
gib_imlib.c:552: error: `im' undeclared (first use in this function)
gib_imlib.c:553: warning: implicit declaration of function `imlib_image_tile'
gib_imlib.c: At top level:
gib_imlib.c:557: error: syntax error before "im"
gib_imlib.c: In function `gib_imlib_image_blur':
gib_imlib.c:559: error: `im' undeclared (first use in this function)
gib_imlib.c:560: warning: implicit declaration of function `imlib_image_blur'
gib_imlib.c:560: error: `radius' undeclared (first use in this function)
gib_imlib.c: At top level:
gib_imlib.c:564: error: syntax error before "im"
gib_imlib.c: In function `gib_imlib_image_sharpen':
gib_imlib.c:566: error: `im' undeclared (first use in this function)
gib_imlib.c:567: warning: implicit declaration of function `imlib_image_sharpen'
gib_imlib.c:567: error: `radius' undeclared (first use in this function)
gib_imlib.c: At top level:
gib_imlib.c:571: error: syntax error before "dest"
gib_imlib.c: In function `gib_imlib_line_clip_and_draw':
gib_imlib.c:575: error: `cx' undeclared (first use in this function)
gib_imlib.c:575: error: `cy' undeclared (first use in this function)
gib_imlib.c:575: error: `cw' undeclared (first use in this function)
gib_imlib.c:575: error: `ch' undeclared (first use in this function)
gib_imlib.c:576: error: `dest' undeclared (first use in this function)
gib_imlib.c:576: error: `x0' undeclared (first use in this function)
gib_imlib.c:576: error: `y0' undeclared (first use in this function)
gib_imlib.c:576: error: `x1' undeclared (first use in this function)
gib_imlib.c:576: error: `y1' undeclared (first use in this function)
gib_imlib.c:576: error: `r' undeclared (first use in this function)
gib_imlib.c:576: error: `g' undeclared (first use in this function)
gib_imlib.c:576: error: `b' undeclared (first use in this function)
gib_imlib.c:576: error: `a' undeclared (first use in this function)
gib_imlib.c: At top level:
gib_imlib.c:581: error: syntax error before "gib_imlib_create_image_from_drawable"
gib_imlib.c:584: warning: return type defaults to `int'
gib_imlib.c: In function `gib_imlib_create_image_from_drawable':
gib_imlib.c:586: warning: implicit declaration of function `imlib_create_image_from_drawable'
gib_imlib.c: In function `gib_imlib_parse_fontpath':
gib_imlib.c:674: warning: implicit declaration of function `imlib_add_path_to_font_path'
gib_imlib.c: At top level:
gib_imlib.c:681: error: syntax error before "gib_imlib_load_font"
gib_imlib.c:682: warning: return type defaults to `int'
gib_imlib.c: In function `gib_imlib_load_font':
gib_imlib.c:683: error: `Imlib_Font' undeclared (first use in this function)
gib_imlib.c:683: error: syntax error before "fn"
gib_imlib.c:685: error: `fn' undeclared (first use in this function)
gib_imlib.c:685: warning: implicit declaration of function `imlib_load_font'
gib_imlib.c: At top level:
gib_imlib.c:694: error: syntax error before "im"
gib_imlib.c: In function `gib_imlib_image_orientate':
gib_imlib.c:696: error: `im' undeclared (first use in this function)
gib_imlib.c:697: warning: implicit declaration of function `imlib_image_orientate'
gib_imlib.c:697: error: `orientation' undeclared (first use in this function)
make[1]: *** [gib_imlib.lo] Error 1
make[1]: Leaving directory `/1/giblib-1.2.4/giblib'
make: *** [all-recursive] Error 1

...I think this is it...giblib is needed for feh...
 
  


Reply


Thread Tools Search this Thread
Search this Thread:

Advanced Search

Posting Rules
You may not post new threads
You may not post replies
You may not post attachments
You may not edit your posts

BB code is On
Smilies are On
[IMG] code is Off
HTML code is Off



Similar Threads
Thread Thread Starter Forum Replies Last Post
Imlib2 phsythax Linux - Software 1 11-05-2005 12:14 PM
Imlib2 problems Maze the Kid Linux - Newbie 4 02-05-2005 07:10 PM
feh / Imlib2: "no imlib2 loader for that file format" froedi Linux - Software 2 11-30-2003 07:44 AM
Imlib2 from source. NSKL Slackware 14 11-26-2003 05:12 AM
imlib2 on slack 9.0 watashiwaotaku7 Linux - Software 1 04-07-2003 08:50 PM

LinuxQuestions.org > Forums > Linux Forums > Linux - Newbie

All times are GMT -5. The time now is 07:36 AM.

Main Menu
Advertisement
My LQ
Write for LQ
LinuxQuestions.org is looking for people interested in writing Editorials, Articles, Reviews, and more. If you'd like to contribute content, let us know.
Main Menu
Syndicate
RSS1  Latest Threads
RSS1  LQ News
Twitter: @linuxquestions
Facebook: linuxquestions Google+: linuxquestions
Open Source Consulting | Domain Registration