Latest LQ Deal: Linux Power User Bundle
Go Back > Forums > Linux Forums > Linux - Newbie
User Name
Linux - Newbie This Linux forum is for members that are new to Linux.
Just starting out and have a question? If it is not in the man pages or the how-to's this is the place!


  Search this Thread
Old 10-25-2014, 05:29 AM   #1
Registered: Jan 2014
Posts: 100

Rep: Reputation: Disabled
compile apache 2.2.29 in Solaris 10 - Newbie


I tried to compile apache 2.2.29 in Solaris 10 but failed the gmake with the following:


local/apr-httpd//lib/ -luuid -lsendfile -lrt -lsocket -lnsl -lpthread
/usr/local/apr-httpd//build-1/libtool --silent --mode=compile gcc -m64 -O3 -DSOLARIS2=10 -D_POSIX_PTHREAD_SEMANTICS -D_REENTRANT -I/usr/local/httpd-2.2.29/srclib/pcre -I. -I/usr/local/httpd-2.2.29/os/unix -I/usr/local/httpd-2.2.29/server/mpm/prefork -I/usr/local/httpd-2.2.29/modules/http -I/usr/local/httpd-2.2.29/modules/filters -I/usr/local/httpd-2.2.29/modules/proxy -I/usr/local/httpd-2.2.29/include -I/usr/local/httpd-2.2.29/modules/generators -I/usr/local/httpd-2.2.29/modules/mappers -I/usr/local/httpd-2.2.29/modules/database -I/usr/local/apr-httpd//include/apr-1 -I/usr/local/apr-util-httpd//include/apr-1 -I/usr/local/httpd-2.2.29/modules/proxy/../generators -I/usr/local/ssl/include -I/usr/local/httpd-2.2.29/modules/ssl -I/usr/local/httpd-2.2.29/modules/dav/main -prefer-non-pic -static -c ab.c && touch ab.lo
/usr/local/apr-httpd//build-1/libtool --silent --mode=link gcc -m64 -O3 -L/usr/local/ssl/lib -R/usr/local/ssl/lib -o ab ab.lo -lm /usr/local/httpd-2.2.29/srclib/pcre/ /usr/local/apr-util-httpd//lib/ -lexpat /usr/local/apr-httpd//lib/ -luuid -lsendfile -lrt -lsocket -lnsl -lpthread -lssl -lcrypto -lsocket -lnsl -ldl
Undefined first referenced
symbol in file
BIO_set_callback .libs/ab.o
BIO_set_callback_arg .libs/ab.o
BIO_get_callback_arg .libs/ab.o
SSL_CTX_set_info_callback .libs/ab.o
ld: fatal: symbol referencing errors. No output written to ab
collect2: ld returned 1 exit status
gmake[2]: *** [ab] Error 1
gmake[2]: Leaving directory `/usr/local/httpd-2.2.29/support'
gmake[1]: *** [all-recursive] Error 1
gmake[1]: Leaving directory `/usr/local/httpd-2.2.29/support'
gmake: *** [all-recursive] Error 1

Could anyone advise?

Thanks in advance.


Thread Tools Search this Thread
Search this Thread:

Advanced Search

Posting Rules
You may not post new threads
You may not post replies
You may not post attachments
You may not edit your posts

BB code is On
Smilies are On
[IMG] code is Off
HTML code is Off

Similar Threads
Thread Thread Starter Forum Replies Last Post
Compile on Solaris 10 acreulant Solaris / OpenSolaris 3 12-01-2011 12:34 PM
Help! compile c on solaris 10 jeffsmugs Solaris / OpenSolaris 1 08-01-2008 01:43 AM
how to compile in Solaris. What i must install??? tuanngochut Solaris / OpenSolaris 3 01-16-2006 04:29 AM
how to compile c in solaris mili Solaris / OpenSolaris 2 05-02-2005 07:38 AM
has anyone ever made a successful compile of apache source in solaris 9 x86/sparc? spyghost Solaris / OpenSolaris 3 10-11-2004 06:09 PM > Forums > Linux Forums > Linux - Newbie

All times are GMT -5. The time now is 11:43 AM.

Main Menu
Write for LQ is looking for people interested in writing Editorials, Articles, Reviews, and more. If you'd like to contribute content, let us know.
Main Menu
RSS1  Latest Threads
RSS1  LQ News
Twitter: @linuxquestions
Facebook: linuxquestions Google+: linuxquestions
Open Source Consulting | Domain Registration