Download your favorite Linux distribution at LQ ISO.
Go Back > Forums > Linux Forums > Linux - Mobile
User Name
Linux - Mobile This forum is for the discussion of all topics relating to Mobile Linux. This includes Android, Tizen, Firefox OS, Sailfish OS, Maemo, MeeGo, Ubuntu Mobile, WebOS, Open Mobile Alliance and other similar projects and products.
A reminder that LQ now has a dedicated Android sister site:


  Search this Thread
Old 07-26-2010, 02:30 PM   #1
LQ Newbie
Registered: Jul 2010
Posts: 5

Rep: Reputation: 0
Android Kernel Compilation Error

Dear all,
I am preparing kernel zImage for poting inti my Arm board mini2440. While compiling the kernel for Android i have come across this error,

In file included from drivers/usb/host/ohci-hcd.c:1002:
drivers/usb/host/ohci-s3c2410.c: In function 'ohci_hcd_s3c2410_drv_resume':
drivers/usb/host/ohci-s3c2410.c:538: error: implicit declaration of function 'ohci_finish_controller_resume'
make[3]: *** [drivers/usb/host/ohci-hcd.o] Error 1
make[2]: *** [drivers/usb/host] Error 2
make[1]: *** [drivers/usb] Error 2
make: *** [drivers] Error 2

I guess some header file is missing for the particular function.. or i should define the ohci_finish_controller_resume function..if so how to do it..Any ideas would be helpful..
Old 07-27-2010, 06:59 AM   #2
LQ Guru
Registered: Jan 2004
Location: NJ, USA
Distribution: Slackware, Debian
Posts: 5,852

Rep: Reputation: 357Reputation: 357Reputation: 357Reputation: 357
Is this the complete error message? Does it mention any missing files earlier in the error output?
Old 07-27-2010, 11:13 AM   #3
LQ Newbie
Registered: Jul 2010
Posts: 5

Original Poster
Rep: Reputation: 0
hello MX3FGX

yes this is the error message.. i hope the function has not defined by specific header file... but couldnot guess what is the header to be used in that place..


controller, error, host, interface, open

Thread Tools Search this Thread
Search this Thread:

Advanced Search

Posting Rules
You may not post new threads
You may not post replies
You may not post attachments
You may not edit your posts

BB code is On
Smilies are On
[IMG] code is Off
HTML code is Off

Similar Threads
Thread Thread Starter Forum Replies Last Post
Kernel compilation error: Error 15: File not found Niceman2005 Linux - General 9 10-04-2007 03:45 AM
kernel compilation error .. LN85 Linux - Kernel 0 06-28-2007 03:38 AM
Kernel compilation error!! vishamr2000 Linux - General 8 02-27-2006 10:48 AM
kernel compilation error Slackware 2 12-06-2005 05:07 PM
kernel compilation error bond_7942 Linux - General 1 02-02-2005 04:35 AM > Forums > Linux Forums > Linux - Mobile

All times are GMT -5. The time now is 06:47 PM.

Main Menu
Write for LQ is looking for people interested in writing Editorials, Articles, Reviews, and more. If you'd like to contribute content, let us know.
Main Menu
RSS1  Latest Threads
RSS1  LQ News
Twitter: @linuxquestions
Facebook: linuxquestions Google+: linuxquestions
Open Source Consulting | Domain Registration