Latest LQ Deal: Complete CCNA, CCNP & Red Hat Certification Training Bundle
Go Back > Forums > Linux Forums > Linux - General
User Name
Linux - General This Linux forum is for general Linux questions and discussion.
If it is Linux Related and doesn't seem to fit in any other forum then this is the place.


  Search this Thread
Old 07-20-2005, 08:05 PM   #1
Registered: Dec 2003
Posts: 51

Rep: Reputation: 15
weird make errors

i keep having errors no matter what a try to "make". Im using suse 9.2. I keep seeing this stuff even if ./configure completes properly. It is too much to show here but part of it is below. Also, I can install xineui fine but when I try to install kaffiene, it cant detect xinelib. If I go into yast, xinelib shows as libxine. If that is the problem, can someone tell me how to fix it?
make[3]: Entering directory `/home/Rose/My Downloads/xine-lib-1.0.1/xine-lib-1.0.1/misc'
/bin/sh ../mkinstalldirs /usr/local/bin
/usr/bin/install -c xine-config /usr/local/bin/xine-config
/bin/sh ../mkinstalldirs /usr/local/lib/pkgconfig
/usr/bin/install -c -m 644 libxine.pc /usr/local/lib/pkgconfig/libxine.pc
make install-data-hook
make[4]: Entering directory `/home/Rose/My Downloads/xine-lib-1.0.1/xine-lib-1.0.1/misc'
make[4]: Leaving directory `/home/Rose/My Downloads/xine-lib-1.0.1/xine-lib-1.0.1/misc'
make[3]: Leaving directory `/home/Rose/My Downloads/xine-lib-1.0.1/xine-lib-1.0.1/misc'
make[2]: Leaving directory `/home/Rose/My Downloads/xine-lib-1.0.1/xine-lib-1.0.1/misc'
make[1]: Leaving directory `/home/Rose/My Downloads/xine-lib-1.0.1/xine-lib-1.0.1/misc'
Making install in include
make[1]: Entering directory `/home/Rose/My Downloads/xine-lib-1.0.1/xine-lib-1.0.1/include'
make[2]: Entering directory `/home/Rose/My Downloads/xine-lib-1.0.1/xine-lib-1.0.1/include'
make[2]: Nothing to be done for `install-exec-am'.

part of weird make error
/bin/sh ../mkinstalldirs /usr/local/include
/usr/bin/install -c -m 644 xine.h /usr/local/include/xine.h
sed -e '/^\/\*_x_/d' xine.h > /usr/local/include/xine.h
make[2]: Leaving directory `/home/Rose/My Downloads/xine-lib-1.0.1/xine-lib-1.0.1/include'
make[1]: Leaving directory `/home/Rose/My Downloads/xine-lib-1.0.1/xine-lib-1.0.1/include'
Making install in lib
make[1]: Entering directory `/home/Rose/My Downloads/xine-lib-1.0.1/xine-lib-1.0.1/lib'
/bin/sh ../libtool-nofpic --mode=link gcc -mcpu=athlon -O3 -pipe -fomit-frame-pointer -falign-functions=4 -falign-loops=4 -falign-jumps=4 -mpreferred-stack-boundary=2 -fexpensive-optimizations -fschedule-insns2 -fno-strict-aliasing -ffast-math -funroll-loops -finline-functions -Wall -DNDEBUG -D_REENTRANT -D_FILE_OFFSET_BITS=64 -DXINE_COMPILE -Wnested-externs -Wcast-align -Wchar-subscripts -Wmissing-declarations -Wmissing-prototypes -o
mkdir .libs
ar cru .libs/libxineposix.a
ranlib .libs/libxineposix.a
(cd .libs && rm -f && ln -s ../
make[2]: Entering directory `/home/Rose/My Downloads/xine-lib-1.0.1/xine-lib-1.0.1/lib'
make[2]: Nothing to be done for `install-exec-am'.
/home/Rose/My Downloads/xine-lib-1.0.1/xine-lib-1.0.1/install-sh -d /usr/local/include/xine
make[2]: /home/Rose/My: Command not found
make[2]: *** [install-includeHEADERS] Error 127
make[2]: Leaving directory `/home/Rose/My Downloads/xine-lib-1.0.1/xine-lib-1.0.1/lib'
make[1]: *** [install-am] Error 2
make[1]: Leaving directory `/home/Rose/My Downloads/xine-lib-1.0.1/xine-lib-1.0.1/lib'
make: *** [install-recursive] Error 1
Old 07-20-2005, 08:10 PM   #2
Registered: Apr 2001
Location: Bremen, Germany
Distribution: Debian
Posts: 303

Rep: Reputation: 30
Re: weird make errors

Originally posted by invinciblegod
make[2]: /home/Rose/My: Command not found
Try renaming My Documents to something without a blank in the name or compile in some other directory.
Old 07-20-2005, 08:51 PM   #3
Registered: Dec 2003
Posts: 51

Original Poster
Rep: Reputation: 15
I tried that and now it does something different. After a while, it starts spewing out garbage. An example is below. Someone help me please!
S -DG_DISABLE_DEPRECATED -DGLIB_COMPILATION -pthread -g -O2 -Wall -MT grand.lo -MD -MP -MF ".deps/grand.Tpo" \
-c -o grand.lo `test -f 'grand.c' || echo './'`grand.c; \
then mv -f ".deps/grand.Tpo" ".deps/grand.Plo"; \
else rm -f ".deps/grand.Tpo"; exit 1; \
gcc -DHAVE_CONFIG_H -I. -I. -I.. -I.. -DG_LOG_DOMAIN=\"GLib\" -DG_DISABLE_CAST_CHECKS -DG_DISABLE_DEPRECATED -DGLIB_COMPILATION -pthread -g -O2 -Wall -MT grand.lo -MD -MP -MF .deps/grand.Tpo -c grand.c -fPIC -DPIC -o .libs/grand.o
if /bin/sh ../libtool --mode=compile gcc -DHAVE_CONFIG_H -I. -I. -I.. -I.. -DG_LOG_DOMAIN=\"GLib\" -DG_DISABLE_CAST_CHECKS -DG_DISABLE_DEPRECATED -DGLIB_COMPILATION -pthread -g -O2 -Wall -MT gscanner.lo -MD -MP -MF ".deps/gscanner.Tpo" \
-c -o gscanner.lo `test -f 'gscanner.c' || echo './'`gscanner.c; \
then mv -f ".deps/gscanner.Tpo" ".deps/gscanner.Plo"; \
else rm -f ".deps/gscanner.Tpo"; exit 1; \
gcc -DHAVE_CONFIG_H -I. -I. -I.. -I.. -DG_LOG_DOMAIN=\"GLib\" -DG_DISABLE_CAST_CHECKS -DG_DISABLE_DEPRECATED -DGLIB_COMPILATION -pthread -g -O2 -Wall -MT gscanner.lo -MD -MP -MF .deps/gscanner.Tpo -c gscanner.c -fPIC -DPIC -o .libs/gscanner.o
if /bin/sh ../libtool --mode=compile gcc -DHAVE_CONFIG_H -I. -I. -I.. -I.. -DG_LOG_DOMAIN=\"GLib\" -DG_DISABLE_CAST_CHECKS -DG_DISABLE_DEPRECATED -DGLIB_COMPILATION -pthread -g -O2 -Wall -MT gshell.lo -MD -MP -MF ".deps/gshell.Tpo" \
-c -o gshell.lo `test -f 'gshell.c' || echo './'`gshell.c; \
then mv -f ".deps/gshell.Tpo" ".deps/gshell.Plo"; \
else rm -f ".deps/gshell.Tpo"; exit 1; \
gcc -DHAVE_CONFIG_H -I. -I. -I.. -I.. -DG_LOG_DOMAIN=\"GLib\" -DG_DISABLE_CAST_CHECKS -DG_DISABLE_DEPRECATED -DGLIB_COMPILATION -pthread -g -O2 -Wall -MT gshell.lo -MD -MP -MF .deps/gshell.Tpo -c gshell.c -fPIC -DPIC -o .libs/gshell.o
if /bin/sh ../libtool --mode=compile gcc -DHAVE_CONFIG_H -I. -I. -I.. -I.. -DG_LOG_DOMAIN=\"GLib\" -DG_DISABLE_CAST_CHECKS -DG_DISABLE_DEPRECATED -DGLIB_COMPILATION -pthread -g -O2 -Wall -MT gslist.lo -MD -MP -MF ".deps/gslist.Tpo" \
-c -o gslist.lo `test -f 'gslist.c' || echo './'`gslist.c; \
then mv -f ".deps/gslist.Tpo" ".deps/gslist.Plo"; \
else rm -f ".deps/gslist.Tpo"; exit 1; \
Old 07-20-2005, 08:59 PM   #4
Registered: Apr 2001
Location: Bremen, Germany
Distribution: Debian
Posts: 303

Rep: Reputation: 30
That's not garbage, that's the program compiling. The commands you see being executed are what's in the Makefile.


Thread Tools Search this Thread
Search this Thread:

Advanced Search

Posting Rules
You may not post new threads
You may not post replies
You may not post attachments
You may not edit your posts

BB code is On
Smilies are On
[IMG] code is On
HTML code is Off

Similar Threads
Thread Thread Starter Forum Replies Last Post
Really, really Weird trouble with make (make error 2) flyeater SUSE / openSUSE 5 06-20-2005 01:05 PM
Chap 5 Binutils make LDFLAGS & make install errors shotokan Linux From Scratch 5 04-10-2005 04:01 AM
gtk+-2.6.0 + weird errors l00zer Linux - Newbie 6 01-23-2005 09:22 PM
Weird errors with MA111 on FC 2 ssimontis Linux - Wireless Networking 3 09-18-2004 10:24 AM
Weird IO errors link1305 Linux - Newbie 1 11-14-2003 07:56 PM > Forums > Linux Forums > Linux - General

All times are GMT -5. The time now is 06:30 PM.

Main Menu
Write for LQ is looking for people interested in writing Editorials, Articles, Reviews, and more. If you'd like to contribute content, let us know.
Main Menu
RSS1  Latest Threads
RSS1  LQ News
Twitter: @linuxquestions
Facebook: linuxquestions Google+: linuxquestions
Open Source Consulting | Domain Registration