LinuxQuestions.org
Visit Jeremy's Blog.
Go Back   LinuxQuestions.org > Forums > Linux Forums > Linux - General
User Name
Password
Linux - General This Linux forum is for general Linux questions and discussion.
If it is Linux Related and doesn't seem to fit in any other forum then this is the place.

Notices


Reply
  Search this Thread
Old 07-22-2003, 04:05 PM   #1
thefallen
LQ Newbie
 
Registered: Jun 2003
Distribution: Gentoo, Debian
Posts: 15

Rep: Reputation: 0
module recompiling (ho)errors


Hello.
I wanted to add NTFS support to my kernel so I decided to compile it with these and other new settings. It was the first time i compiled this version of the kernel (2.4.20-8). Compiling the kernel worked fine, but compiling the modules didn't. I'm using gcc-3.2.2 under RedHat9.0. I don't have a real clue what it might be, but maybe the error listing might be of some sort of help. I'll post it as a reply to this one.
 
Old 07-22-2003, 04:09 PM   #2
thefallen
LQ Newbie
 
Registered: Jun 2003
Distribution: Gentoo, Debian
Posts: 15

Original Poster
Rep: Reputation: 0
Ok here's the listing: (stdout+stderr)
-----------------------------------------------------------------------
make -r -f tmp_include_depends all
make[1]: Entering directory `/usr/src/linux-2.4.20-8'
make[1]: Circular /usr/src/linux-2.4.20-8/include/asm/smplock.h <- /usr/src/linux-2.4.20-8/include/linux/interrupt.h dependency dropped.
make[1]: Circular /usr/src/linux-2.4.20-8/include/linux/netfilter_ipv4/ip_conntrack.h <- /usr/src/linux-2.4.20-8/include/linux/netfilter_ipv4/ip_conntrack_helper.h dependency dropped.
make[1]: Nothing to be done for `all'.
make[1]: Leaving directory `/usr/src/linux-2.4.20-8'
make -C kernel CFLAGS="-D__KERNEL__ -I/usr/src/linux-2.4.20-8/include -Wall -Wstrict-prototypes -Wno-trigraphs -O2 -fno-strict-aliasing -fno-common -fomit-frame-pointer -pipe -mpreferred-stack-boundary=2 -march=i686 -falign-functions=4 -DMODULE -DMODVERSIONS -include /usr/src/linux-2.4.20-8/include/linux/modversions.h" MAKING_MODULES=1 modules
make[1]: Entering directory `/usr/src/linux-2.4.20-8/kernel'
make[1]: Nothing to be done for `modules'.
make[1]: Leaving directory `/usr/src/linux-2.4.20-8/kernel'
make -C drivers CFLAGS="-D__KERNEL__ -I/usr/src/linux-2.4.20-8/include -Wall -Wstrict-prototypes -Wno-trigraphs -O2 -fno-strict-aliasing -fno-common -fomit-frame-pointer -pipe -mpreferred-stack-boundary=2 -march=i686 -falign-functions=4 -DMODULE -DMODVERSIONS -include /usr/src/linux-2.4.20-8/include/linux/modversions.h" MAKING_MODULES=1 modules
make[1]: Entering directory `/usr/src/linux-2.4.20-8/drivers'
make -C addon modules
make[2]: Entering directory `/usr/src/linux-2.4.20-8/drivers/addon'
make[2]: Nothing to be done for `modules'.
make[2]: Leaving directory `/usr/src/linux-2.4.20-8/drivers/addon'
make -C block modules
make[2]: Entering directory `/usr/src/linux-2.4.20-8/drivers/block'
make[2]: Nothing to be done for `modules'.
make[2]: Leaving directory `/usr/src/linux-2.4.20-8/drivers/block'
make -C cdrom modules
make[2]: Entering directory `/usr/src/linux-2.4.20-8/drivers/cdrom'
gcc -D__KERNEL__ -I/usr/src/linux-2.4.20-8/include -Wall -Wstrict-prototypes -Wno-trigraphs -O2 -fno-strict-aliasing -fno-common -fomit-frame-pointer -pipe -mpreferred-stack-boundary=2 -march=i686 -falign-functions=4 -DMODULE -DMODVERSIONS -include /usr/src/linux-2.4.20-8/include/linux/modversions.h -nostdinc -iwithprefix include -DKBUILD_BASENAME=cdrom -DEXPORT_SYMTAB -c cdrom.c
In file included from /usr/src/linux-2.4.20-8/include/linux/prefetch.h:13,
from /usr/src/linux-2.4.20-8/include/linux/list.h:6,
from /usr/src/linux-2.4.20-8/include/linux/module.h:12,
from cdrom.c:255:
/usr/src/linux-2.4.20-8/include/asm/processor.h:60: warning: parameter names (without types) in function declaration
/usr/src/linux-2.4.20-8/include/asm/processor.h:60: field `loops_per_jiffy_R_ver_str' declared as a function
/usr/src/linux-2.4.20-8/include/asm/processor.h:82: invalid suffix on integer constant
/usr/src/linux-2.4.20-8/include/asm/processor.h:82: parse error before numeric constant
/usr/src/linux-2.4.20-8/include/asm/processor.h:82: warning: function declaration isn't a prototype
In file included from /usr/src/linux-2.4.20-8/include/linux/prefetch.h:13,
from /usr/src/linux-2.4.20-8/include/linux/list.h:6,
from /usr/src/linux-2.4.20-8/include/linux/module.h:12,
from cdrom.c:255:
/usr/src/linux-2.4.20-8/include/asm/processor.h:267:1: warning: "EISA_bus" redefined
In file included from /usr/src/linux-2.4.20-8/include/linux/modversions.h:132,
from <command line>:1:
/usr/src/linux-2.4.20-8/include/linux/modules/i386_ksyms.ver:92:1: warning: this is the location of the previous definition
/usr/src/linux-2.4.20-8/include/asm/processor.h:269: warning: parameter names (without types) in function declaration
In file included from cdrom.c:255:
/usr/src/linux-2.4.20-8/include/linux/module.h:183: invalid suffix on integer constant
/usr/src/linux-2.4.20-8/include/linux/module.h:183: parse error before numeric constant
/usr/src/linux-2.4.20-8/include/linux/module.h:183: `inter_module_register_R_ver_str' declared as function returning a function
/usr/src/linux-2.4.20-8/include/linux/module.h:183: warning: function declaration isn't a prototype
/usr/src/linux-2.4.20-8/include/linux/module.h:184: invalid suffix on integer constant
/usr/src/linux-2.4.20-8/include/linux/module.h:184: parse error before numeric constant
/usr/src/linux-2.4.20-8/include/linux/module.h:184: `inter_module_unregister_R_ver_str' declared as function returning a function
/usr/src/linux-2.4.20-8/include/linux/module.h:184: warning: function declaration isn't a prototype
/usr/src/linux-2.4.20-8/include/linux/module.h:185: `inter_module_get_R_ver_str' declared as function returning a function
/usr/src/linux-2.4.20-8/include/linux/module.h:185: warning: parameter names (without types) in function declaration
/usr/src/linux-2.4.20-8/include/linux/module.h:186: `inter_module_get_request_R_ver_str' declared as function returning a function
/usr/src/linux-2.4.20-8/include/linux/module.h:186: warning: parameter names (without types) in function declaration
/usr/src/linux-2.4.20-8/include/linux/module.h:187: invalid suffix on integer constant
/usr/src/linux-2.4.20-8/include/linux/module.h:187: parse error before numeric constant
/usr/src/linux-2.4.20-8/include/linux/module.h:187: `inter_module_put_R_ver_str' declared as function returning a function
/usr/src/linux-2.4.20-8/include/linux/module.h:187: warning: function declaration isn't a prototype
/usr/src/linux-2.4.20-8/include/linux/module.h:196: `try_inc_mod_count_R_ver_str' declared as function returning a function
/usr/src/linux-2.4.20-8/include/linux/module.h:196: warning: parameter names (without types) in function declaration
In file included from /usr/src/linux-2.4.20-8/include/linux/wait.h:13,
from /usr/src/linux-2.4.20-8/include/linux/fs.h:12,
from cdrom.c:256:
/usr/src/linux-2.4.20-8/include/linux/kernel.h:60: invalid suffix on integer constant
/usr/src/linux-2.4.20-8/include/linux/kernel.h:60: parse error before numeric constant
/usr/src/linux-2.4.20-8/include/linux/kernel.h:60: warning: function declaration isn't a prototype
/usr/src/linux-2.4.20-8/include/linux/kernel.h:61: invalid suffix on integer constant
/usr/src/linux-2.4.20-8/include/linux/kernel.h:61: parse error before numeric constant
/usr/src/linux-2.4.20-8/include/linux/kernel.h:62: `panic_R_ver_str' declared as function returning a function
/usr/src/linux-2.4.20-8/include/linux/kernel.h:62: warning: function declaration isn't a prototype
/usr/src/linux-2.4.20-8/include/linux/kernel.h:68: parse error before numeric constant
/usr/src/linux-2.4.20-8/include/linux/kernel.h:68: `simple_strtoul_R_ver_str' declared as function returning a function
/usr/src/linux-2.4.20-8/include/linux/kernel.h:68: warning: function declaration isn't a prototype
/usr/src/linux-2.4.20-8/include/linux/kernel.h:69: invalid suffix on integer constant
/usr/src/linux-2.4.20-8/include/linux/kernel.h:69: parse error before numeric constant
/usr/src/linux-2.4.20-8/include/linux/kernel.h:69: `simple_strtol_R_ver_str' declared as function returning a function
/usr/src/linux-2.4.20-8/include/linux/kernel.h:69: warning: function declaration isn't a prototype
/usr/src/linux-2.4.20-8/include/linux/kernel.h:70: invalid suffix on integer constant
/usr/src/linux-2.4.20-8/include/linux/kernel.h:70: parse error before numeric constant
/usr/src/linux-2.4.20-8/include/linux/kernel.h:70: `simple_strtoull_R_ver_str' declared as function returning a function
/usr/src/linux-2.4.20-8/include/linux/kernel.h:70: warning: function declaration isn't a prototype
/usr/src/linux-2.4.20-8/include/linux/kernel.h:72: invalid suffix on integer constant
/usr/src/linux-2.4.20-8/include/linux/kernel.h:72: parse error before numeric constant
/usr/src/linux-2.4.20-8/include/linux/kernel.h:73: `sprintf_R_ver_str' declared as function returning a function
/usr/src/linux-2.4.20-8/include/linux/kernel.h:73: warning: function declaration isn't a prototype
/usr/src/linux-2.4.20-8/include/linux/kernel.h:74: invalid suffix on integer constant
/usr/src/linux-2.4.20-8/include/linux/kernel.h:74: parse error before numeric constant
/usr/src/linux-2.4.20-8/include/linux/kernel.h:74: `vsprintf_R_ver_str' declared as function returning a function
/usr/src/linux-2.4.20-8/include/linux/kernel.h:74: warning: function declaration isn't a prototype
/usr/src/linux-2.4.20-8/include/linux/kernel.h:75: invalid suffix on integer constant
/usr/src/linux-2.4.20-8/include/linux/kernel.h:75: parse error before numeric constant
/usr/src/linux-2.4.20-8/include/linux/kernel.h:76: `snprintf_R_ver_str' declared as function returning a function
/usr/src/linux-2.4.20-8/include/linux/kernel.h:76: warning: function declaration isn't a prototype
/usr/src/linux-2.4.20-8/include/linux/kernel.h:77: invalid suffix on integer constant
/usr/src/linux-2.4.20-8/include/linux/kernel.h:77: parse error before numeric constant
/usr/src/linux-2.4.20-8/include/linux/kernel.h:77: `vsnprintf_R_ver_str' declared as function returning a function
/usr/src/linux-2.4.20-8/include/linux/kernel.h:77: warning: function declaration isn't a prototype
/usr/src/linux-2.4.20-8/include/linux/kernel.h:79: invalid suffix on integer constant
/usr/src/linux-2.4.20-8/include/linux/kernel.h:79: parse error before numeric constant
/usr/src/linux-2.4.20-8/include/linux/kernel.h:80: `sscanf_R_ver_str' declared as function returning a function
/usr/src/linux-2.4.20-8/include/linux/kernel.h:80: warning: function declaration isn't a prototype
/usr/src/linux-2.4.20-8/include/linux/kernel.h:81: `vsscanf_R_ver_str' declared as function returning a function
/usr/src/linux-2.4.20-8/include/linux/kernel.h:81: warning: parameter names (without types) in function declaration
/usr/src/linux-2.4.20-8/include/linux/kernel.h:83: `get_option_R_ver_str' declared as function returning a function
/usr/src/linux-2.4.20-8/include/linux/kernel.h:83: warning: parameter names (without types) in function declaration
/usr/src/linux-2.4.20-8/include/linux/kernel.h:84: invalid suffix on integer constant
/usr/src/linux-2.4.20-8/include/linux/kernel.h:84: parse error before numeric constant
/usr/src/linux-2.4.20-8/include/linux/kernel.h:84: `get_options_R_ver_str' declared as function returning a function
/usr/src/linux-2.4.20-8/include/linux/kernel.h:84: warning: function declaration isn't a prototype
/usr/src/linux-2.4.20-8/include/linux/kernel.h:85: invalid suffix on integer constant
/usr/src/linux-2.4.20-8/include/linux/kernel.h:85: parse error before numeric constant
/usr/src/linux-2.4.20-8/include/linux/kernel.h:85: `memparse_R_ver_str' declared as function returning a function
/usr/src/linux-2.4.20-8/include/linux/kernel.h:85: warning: function declaration isn't a prototype
/usr/src/linux-2.4.20-8/include/linux/kernel.h:91: invalid suffix on integer constant
/usr/src/linux-2.4.20-8/include/linux/kernel.h:91: parse error before numeric constant
/usr/src/linux-2.4.20-8/include/linux/kernel.h:92: `printk_R_ver_str' declared as function returning a function
/usr/src/linux-2.4.20-8/include/linux/kernel.h:92: warning: function declaration isn't a prototype
/usr/src/linux-2.4.20-8/include/linux/kernel.h:108: parse error before numeric constant
/usr/src/linux-2.4.20-8/include/linux/kernel.h:108: warning: function declaration isn't a prototype
/usr/src/linux-2.4.20-8/include/linux/kernel.h:109: warning: parameter names (without types) in function declaration
/usr/src/linux-2.4.20-8/include/linux/kernel.h:114: invalid suffix on integer constant
/usr/src/linux-2.4.20-8/include/linux/kernel.h:114: parse error before numeric constant
/usr/src/linux-2.4.20-8/include/linux/kernel.h:114: `dump_stack_R_ver_str' declared as function returning a function
/usr/src/linux-2.4.20-8/include/linux/kernel.h:114: warning: function declaration isn't a prototype
/usr/src/linux-2.4.20-8/include/linux/kernel.h:191: invalid suffix on integer constant
/usr/src/linux-2.4.20-8/include/linux/kernel.h:191: parse error before numeric constant
/usr/src/linux-2.4.20-8/include/linux/kernel.h:191: `__out_of_line_bug_R_ver_str' declared as function returning a function
/usr/src/linux-2.4.20-8/include/linux/kernel.h:191: warning: function declaration isn't a prototype
In file included from /usr/src/linux-2.4.20-8/include/linux/net.h:22,
from /usr/src/linux-2.4.20-8/include/linux/fs.h:15,
from cdrom.c:256:
/usr/src/linux-2.4.20-8/include/linux/socket.h:249: invalid suffix on integer constant
/usr/src/linux-2.4.20-8/include/linux/socket.h:249: parse error before numeric constant
/usr/src/linux-2.4.20-8/include/linux/socket.h:249: `memcpy_fromiovec_R_ver_str' declared as function returning a function
/usr/src/linux-2.4.20-8/include/linux/socket.h:249: warning: function declaration isn't a prototype
/usr/src/linux-2.4.20-8/include/linux/socket.h:258: invalid suffix on integer constant
/usr/src/linux-2.4.20-8/include/linux/socket.h:258: parse error before numeric constant
/usr/src/linux-2.4.20-8/include/linux/socket.h:258: `memcpy_toiovec_R_ver_str' declared as function returning a function
/usr/src/linux-2.4.20-8/include/linux/socket.h:258: warning: function declaration isn't a prototype
/usr/src/linux-2.4.20-8/include/linux/socket.h:259: `memcpy_tokerneliovec_R_ver_str' declared as function returning a function
/usr/src/linux-2.4.20-8/include/linux/socket.h:259: warning: parameter names (without types) in function declaration
/usr/src/linux-2.4.20-8/include/linux/socket.h:260: invalid suffix on integer constant
/usr/src/linux-2.4.20-8/include/linux/socket.h:260: parse error before numeric constant
/usr/src/linux-2.4.20-8/include/linux/socket.h:260: `move_addr_to_user_R_ver_str' declared as function returning a function
/usr/src/linux-2.4.20-8/include/linux/socket.h:260: warning: function declaration isn't a prototype
/usr/src/linux-2.4.20-8/include/linux/socket.h:261: invalid suffix on integer constant
/usr/src/linux-2.4.20-8/include/linux/socket.h:261: parse error before numeric constant
/usr/src/linux-2.4.20-8/include/linux/socket.h:261: `move_addr_to_kernel_R_ver_str' declared as function returning a function
/usr/src/linux-2.4.20-8/include/linux/socket.h:261: warning: function declaration isn't a prototype
/usr/src/linux-2.4.20-8/include/linux/socket.h:262: `put_cmsg_R_ver_str' declared as function returning a function
/usr/src/linux-2.4.20-8/include/linux/socket.h:262: warning: parameter names (without types) in function declaration
In file included from /usr/src/linux-2.4.20-8/include/linux/fs.h:15,
from cdrom.c:256:
/usr/src/linux-2.4.20-8/include/linux/net.h:98: invalid suffix on integer constant
/usr/src/linux-2.4.20-8/include/linux/net.h:98: parse error before numeric constant
/usr/src/linux-2.4.20-8/include/linux/net.h:99: warning: function declaration isn't a prototype
/usr/src/linux-2.4.20-8/include/linux/net.h:99: field `getname_R_ver_str' declared as a function
/usr/src/linux-2.4.20-8/include/linux/net.h:134: invalid suffix on integer constant
/usr/src/linux-2.4.20-8/include/linux/net.h:134: parse error before numeric constant
/usr/src/linux-2.4.20-8/include/linux/net.h:134: `sock_unregister_R_ver_str' declared as function returning a function
/usr/src/linux-2.4.20-8/include/linux/net.h:134: warning: function declaration isn't a prototype
/usr/src/linux-2.4.20-8/include/linux/net.h:143: `net_ratelimit_R_ver_str' declared as function returning a function
/usr/src/linux-2.4.20-8/include/linux/net.h:143: warning: parameter names (without types) in function declaration
/usr/src/linux-2.4.20-8/include/linux/net.h:144: invalid suffix on integer constant
/usr/src/linux-2.4.20-8/include/linux/net.h:144: parse error before numeric constant
/usr/src/linux-2.4.20-8/include/linux/net.h:144: `net_random_R_ver_str' declared as function returning a function
/usr/src/linux-2.4.20-8/include/linux/net.h:144: warning: function declaration isn't a prototype
/usr/src/linux-2.4.20-8/include/linux/net.h:145: `net_srandom_R_ver_str' declared as function returning a function
/usr/src/linux-2.4.20-8/include/linux/net.h:145: warning: parameter names (without types) in function declaration
In file included from /usr/src/linux-2.4.20-8/include/linux/fs.h:16,
from cdrom.c:256:
/usr/src/linux-2.4.20-8/include/linux/kdev_t.h:76: `kdevname_R_ver_str' declared as function returning a function
/usr/src/linux-2.4.20-8/include/linux/kdev_t.h:76: warning: parameter names (without types) in function declaration
In file included from /usr/src/linux-2.4.20-8/include/linux/fs.h:19,
from cdrom.c:256:
/usr/src/linux-2.4.20-8/include/linux/dcache.h:176: `flush_dentry_attributes_R_ver_str' declared as function returning a function
/usr/src/linux-2.4.20-8/include/linux/dcache.h:176: warning: parameter names (without types) in function declaration
/usr/src/linux-2.4.20-8/include/linux/dcache.h:182: invalid suffix on integer constant
/usr/src/linux-2.4.20-8/include/linux/dcache.h:182: parse error before numeric constant
/usr/src/linux-2.4.20-8/include/linux/dcache.h:182: `prune_dcache_R_ver_str' declared as function returning a function
/usr/src/linux-2.4.20-8/include/linux/dcache.h:182: warning: function declaration isn't a prototype
/usr/src/linux-2.4.20-8/include/linux/dcache.h: In function `dget':
/usr/src/linux-2.4.20-8/include/linux/dcache.h:254: invalid suffix on integer constant
/usr/src/linux-2.4.20-8/include/linux/dcache.h:254: called object is not a function
In file included from /usr/src/linux-2.4.20-8/include/linux/fs.h:23,
from cdrom.c:256:
/usr/src/linux-2.4.20-8/include/linux/string.h: At top level:
/usr/src/linux-2.4.20-8/include/linux/string.h:15: invalid suffix on integer constant
/usr/src/linux-2.4.20-8/include/linux/string.h:15: parse error before numeric constant
/usr/src/linux-2.4.20-8/include/linux/string.h:15: warning: function declaration isn't a prototype
/usr/src/linux-2.4.20-8/include/linux/string.h:16: invalid suffix on integer constant
/usr/src/linux-2.4.20-8/include/linux/string.h:16: parse error before numeric constant
/usr/src/linux-2.4.20-8/include/linux/string.h:16: `strpbrk_R_ver_str' declared as function returning a function
/usr/src/linux-2.4.20-8/include/linux/string.h:16: warning: function declaration isn't a prototype
/usr/src/linux-2.4.20-8/include/linux/string.h:17: `strtok_R_ver_str' declared as function returning a function
/usr/src/linux-2.4.20-8/include/linux/string.h:17: warning: parameter names (without types) in function declaration
/usr/src/linux-2.4.20-8/include/linux/string.h:18: invalid suffix on integer constant
/usr/src/linux-2.4.20-8/include/linux/string.h:18: parse error before numeric constant
/usr/src/linux-2.4.20-8/include/linux/string.h:18: `strsep_R_ver_str' declared as function returning a function
/usr/src/linux-2.4.20-8/include/linux/string.h:18: warning: function declaration isn't a prototype
/usr/src/linux-2.4.20-8/include/linux/string.h:19: `strspn_R_ver_str' declared as function returning a function
/usr/src/linux-2.4.20-8/include/linux/string.h:19: warning: parameter names (without types) in function declaration
In file included from /usr/src/linux-2.4.20-8/include/linux/string.h:25,
from /usr/src/linux-2.4.20-8/include/linux/fs.h:23,
from cdrom.c:256:
/usr/src/linux-2.4.20-8/include/asm/string.h:416: invalid suffix on floating constant
/usr/src/linux-2.4.20-8/include/asm/string.h:416: parse error before numeric constant
/usr/src/linux-2.4.20-8/include/asm/string.h:416: `strstr_R_ver_str' declared as function returning a function
/usr/src/linux-2.4.20-8/include/asm/string.h:416: warning: function declaration isn't a prototype
In file included from /usr/src/linux-2.4.20-8/include/linux/fs.h:23,
from cdrom.c:256:
/usr/src/linux-2.4.20-8/include/linux/string.h:46: invalid suffix on floating constant
/usr/src/linux-2.4.20-8/include/linux/string.h:46: parse error before numeric constant
/usr/src/linux-2.4.20-8/include/linux/string.h:46: `strnicmp_R_ver_str' declared as function returning a function
/usr/src/linux-2.4.20-8/include/linux/string.h:46: warning: function declaration isn't a prototype
In file included from cdrom.c:256:
/usr/src/linux-2.4.20-8/include/linux/fs.h:55: invalid suffix on integer constant
/usr/src/linux-2.4.20-8/include/linux/fs.h:55: parse error before numeric constant
/usr/src/linux-2.4.20-8/include/linux/fs.h:55: warning: function declaration isn't a prototype
In file included from /usr/src/linux-2.4.20-8/include/asm/semaphore.h:39,
from /usr/src/linux-2.4.20-8/include/linux/fs.h:200,
from cdrom.c:256:
/usr/src/linux-2.4.20-8/include/asm/system.h:373: floating constant exponent has no digits
/usr/src/linux-2.4.20-8/include/asm/system.h:373: parse error before numeric constant
/usr/src/linux-2.4.20-8/include/asm/system.h:373: `disable_hlt_R_ver_str' declared as function returning a function
/usr/src/linux-2.4.20-8/include/asm/system.h:373: warning: function declaration isn't a prototype
/usr/src/linux-2.4.20-8/include/asm/system.h:374: invalid suffix on integer constant
/usr/src/linux-2.4.20-8/include/asm/system.h:374: parse error before numeric constant
/usr/src/linux-2.4.20-8/include/asm/system.h:374: `enable_hlt_R_ver_str' declared as function returning a function
/usr/src/linux-2.4.20-8/include/asm/system.h:374: warning: function declaration isn't a prototype
/usr/src/linux-2.4.20-8/include/asm/system.h:377: invalid suffix on integer constant
/usr/src/linux-2.4.20-8/include/asm/system.h:377: parse error before numeric constant
/usr/src/linux-2.4.20-8/include/asm/system.h:377: warning: function declaration isn't a prototype
In file included from /usr/src/linux-2.4.20-8/include/linux/affs_fs_i.h:7,
from /usr/src/linux-2.4.20-8/include/linux/fs.h:306,
from cdrom.c:256:
/usr/src/linux-2.4.20-8/include/linux/time.h:45: invalid suffix on integer constant
/usr/src/linux-2.4.20-8/include/linux/time.h:45: parse error before numeric constant
/usr/src/linux-2.4.20-8/include/linux/time.h:45: warning: function declaration isn't a prototype
/usr/src/linux-2.4.20-8/include/linux/time.h: In function `jiffies_to_timespec':
/usr/src/linux-2.4.20-8/include/linux/time.h:47: invalid suffix on integer constant
/usr/src/linux-2.4.20-8/include/linux/time.h:48: invalid suffix on integer constant
/usr/src/linux-2.4.20-8/include/linux/time.h: At top level:
/usr/src/linux-2.4.20-8/include/linux/time.h:101: parse error before numeric constant
/usr/src/linux-2.4.20-8/include/linux/time.h:101: `do_gettimeofday_R_ver_str' declared as function returning a function
/usr/src/linux-2.4.20-8/include/linux/time.h:101: warning: function declaration isn't a prototype
/usr/src/linux-2.4.20-8/include/linux/time.h:102: invalid suffix on integer constant
/usr/src/linux-2.4.20-8/include/linux/time.h:102: parse error before numeric constant
/usr/src/linux-2.4.20-8/include/linux/time.h:102: `do_settimeofday_R_ver_str' declared as function returning a function
/usr/src/linux-2.4.20-8/include/linux/time.h:102: warning: function declaration isn't a prototype
In file included from /usr/src/linux-2.4.20-8/include/linux/fs.h:374,
from cdrom.c:256:
/usr/src/linux-2.4.20-8/include/linux/quota.h:187: syntax error before '{' token
/usr/src/linux-2.4.20-8/include/linux/quota.h:196: parse error before '}' token
/usr/src/linux-2.4.20-8/include/linux/quota.h:198: parse error before "dqstats_R_ver_str"
/usr/src/linux-2.4.20-8/include/linux/quota.h:198: warning: type defaults to `int' in declaration of `dqstats_R_ver_str'
/usr/src/linux-2.4.20-8/include/linux/quota.h:198: warning: parameter names (without types) in function declaration
/usr/src/linux-2.4.20-8/include/linux/quota.h:198: warning: data definition has no type or storage class
In file included from cdrom.c:256:
/usr/src/linux-2.4.20-8/include/linux/fs.h:649: invalid suffix on floating constant
/usr/src/linux-2.4.20-8/include/linux/fs.h:649: parse error before numeric constant
/usr/src/linux-2.4.20-8/include/linux/fs.h:649: warning: function declaration isn't a prototype
In file included from cdrom.c:256:
/usr/src/linux-2.4.20-8/include/linux/fs.h:655: `sys_fcntl_R_ver_str' declared as function returning a function
/usr/src/linux-2.4.20-8/include/linux/fs.h:655: warning: parameter names (without types) in function declaration
/usr/src/linux-2.4.20-8/include/linux/fs.h:656: invalid suffix on integer constant
/usr/src/linux-2.4.20-8/include/linux/fs.h:656: parse error before numeric constant
 
Old 07-22-2003, 04:11 PM   #3
thefallen
LQ Newbie
 
Registered: Jun 2003
Distribution: Gentoo, Debian
Posts: 15

Original Poster
Rep: Reputation: 0
It continues like that for quite some time (the error listing file has aprox 110 kb) and ends with:

cdrom.c:2484: invalid suffix on integer constant
cdrom.c:2484: called object is not a function
cdrom.c: In function `cdrom_exit':
cdrom.c:2643: invalid suffix on integer constant
cdrom.c:2643: warning: null format string
cdrom.c:2643: called object is not a function
make[2]: *** [cdrom.o] Error 1
make[2]: Leaving directory `/usr/src/linux-2.4.20-8/drivers/cdrom'
make[1]: *** [_modsubdir_cdrom] Error 2
make[1]: Leaving directory `/usr/src/linux-2.4.20-8/drivers'
make: *** [_mod_drivers] Error 2
 
  


Reply


Thread Tools Search this Thread
Search this Thread:

Advanced Search

Posting Rules
You may not post new threads
You may not post replies
You may not post attachments
You may not edit your posts

BB code is On
Smilies are On
[IMG] code is On
HTML code is Off



Similar Threads
Thread Thread Starter Forum Replies Last Post
compiling only one module without recompiling the kernel l_9_l Linux - General 8 07-06-2009 10:00 PM
kernel errors after recompiling muerte42200 Linux - Newbie 6 12-27-2004 03:48 AM
recompiling sound module alphaproject Linux - General 0 11-23-2004 04:03 PM
inserting a module without recompiling? Simon Bridge Linux - Software 1 05-14-2004 05:53 PM
Recompiling kernel errors.... johnnyd Linux - General 2 05-01-2001 03:22 PM

LinuxQuestions.org > Forums > Linux Forums > Linux - General

All times are GMT -5. The time now is 04:10 AM.

Main Menu
Advertisement
My LQ
Write for LQ
LinuxQuestions.org is looking for people interested in writing Editorials, Articles, Reviews, and more. If you'd like to contribute content, let us know.
Main Menu
Syndicate
RSS1  Latest Threads
RSS1  LQ News
Twitter: @linuxquestions
Open Source Consulting | Domain Registration