LinuxQuestions.org
Download your favorite Linux distribution at LQ ISO.
Go Back   LinuxQuestions.org > Forums > Linux Forums > Linux - Software > Linux - Games
User Name
Password
Linux - Games This forum is for all discussion relating to gaming in Linux.

Notices


Reply
  Search this Thread
Old 04-12-2004, 04:46 PM   #1
nbn792
Member
 
Registered: Dec 2003
Distribution: Debian
Posts: 109

Rep: Reputation: 15
winex cvs not installing


Winex cvs will not install on my system. Im trying to use some scripts to install winex and when it comes the the "make" step, the installation fails each time, it fails at the same point with other scripts. here is the error code:


GetCVSWineX - Progress(u) : Green is current

0 = Uninstall
1 = Cleanup
2 = CVS checkout
3 = Configure
4 = Make depend
5 = Make #(current step)
6 = Make install
7 = Finish up

-------------------------------------------

Compiling ...




--------- Error log - file /home/garrett/temp/cvswinex/ErrorLog : ---------
./ppl.l:1368: error: `debuglevel' undeclared (first use in this function)
./ppl.l:1368: error: `DEBUGLEVEL_PPLEX' undeclared (first use in this function)
./ppl.l:1370: error: `input_name' undeclared (first use in this function)
./ppl.l:1371: error: `line_number' undeclared (first use in this function)
./ppl.l:1378: error: `pp_macexp' undeclared (first use in this function)
./ppl.l: At top level:
./ppl.l:1386: warning: `macro_add_expansion' was declared implicitly `extern' and later `static'
./ppl.l:1276: warning: previous declaration of `macro_add_expansion'
./ppl.l:1386: warning: type mismatch with previous implicit declaration
./ppl.l:1276: warning: previous implicit declaration of `macro_add_expansion'
./ppl.l:1386: warning: `macro_add_expansion' was previously implicitly declared to return `int'
./ppl.l: In function `macro_add_expansion':
./ppl.l:1387: error: `macexpstackentry_t' undeclared (first use in this function)
./ppl.l:1387: error: `mep' undeclared (first use in this function)
./ppl.l:1396: error: `debuglevel' undeclared (first use in this function)
./ppl.l:1396: error: `DEBUGLEVEL_PPLEX' undeclared (first use in this function)
./ppl.l:1398: error: `input_name' undeclared (first use in this function)
./ppl.l:1399: error: `line_number' undeclared (first use in this function)
./ppl.l: At top level:
./ppl.l:1411: warning: `put_buffer' was declared implicitly `extern' and later `static'
./ppl.l:1151: warning: previous declaration of `put_buffer'
./ppl.l:1411: warning: type mismatch with previous implicit declaration
./ppl.l:1151: warning: previous implicit declaration of `put_buffer'
./ppl.l:1411: warning: `put_buffer' was previously implicitly declared to return `int'
./ppl.l: In function `put_buffer':
./ppl.l:1415: error: `pass_data' undeclared (first use in this function)
./ppl.l: In function `do_include':
./ppl.l:1439: error: `includelogicentry_t' undeclared (first use in this function)
./ppl.l:1439: error: `iep' undeclared (first use in this function)
./ppl.l:1441: error: `includelogiclist' undeclared (first use in this function)
./ppl.l:1462: warning: implicit declaration of function `open_include'
./ppl.l:1462: warning: assignment makes pointer from integer without a cast
./ppl.l:1467: error: `seen_junk' undeclared (first use in this function)
./ppl.l:1468: error: `include_state' undeclared (first use in this function)
./ppl.l:1469: error: `include_ppp' undeclared (first use in this function)
./ppl.l:1470: error: `pass_data' undeclared (first use in this function)
./ppl.l:1473: error: `debuglevel' undeclared (first use in this function)
./ppl.l:1473: error: `DEBUGLEVEL_PPMSG' undeclared (first use in this function)
./ppl.l:1474: error: `input_name' undeclared (first use in this function)
./ppl.l:1474: error: `line_number' undeclared (first use in this function)
./ppl.l:1474: error: `include_ifdepth' undeclared (first use in this function)
./ppl.l: In function `push_ignore_state':
./ppl.l:1488: error: `pp_ignore' undeclared (first use in this function)
./ppl.l: At top level:
lex.ppl.c:15101: warning: `yyunput' defined but not used
make[2]: *** [lex.ppl.o] Error 1
make[2]: Leaving directory `/home/garrett/temp/cvswinex/winex/tools/wrc'
make[1]: *** [wrc] Error 2
make[1]: Leaving directory `/home/garrett/temp/cvswinex/winex/tools'
make: *** [tools] Error 2


Error in Make

Try fixing the error based on the output above, and
run the script again, without paramaters (Eg: GetCVSWineX)

Please help!
 
Old 04-28-2004, 09:31 AM   #2
dbr
LQ Newbie
 
Registered: Apr 2004
Posts: 3

Rep: Reputation: 0
It seems winex needs an older version of flex. You should install the package flex-old.
 
Old 05-01-2004, 01:35 AM   #3
zero79
Member
 
Registered: Nov 2003
Location: Ohio
Distribution: Debian Unstable
Posts: 460

Rep: Reputation: 30
i'm using Debian, and i get the exact same output. i tried "apt-get install flex-old" and then rerunning the winex cvs install script, but i still get the same error. were you able to get this to work nbn792? is there anything else that needs to be installed?
 
Old 05-01-2004, 01:44 AM   #4
zero79
Member
 
Registered: Nov 2003
Location: Ohio
Distribution: Debian Unstable
Posts: 460

Rep: Reputation: 30
actually, i restarted the installer script from scratch and it bails at a different point. it looks like it is having a problem in the "tsx11" directory. is there another library that i need to have installed. here is the output for your viewing pleasure:

Code:
--------- Error log - file /home/zero79/temp/cvswinex/ErrorLog : ---------
ts_xlib.c: In function `TSXOpenIM':
ts_xlib.c:1176: error: `XIM' undeclared (first use in this function)
ts_xlib.c:1176: error: parse error before "r"
ts_xlib.c:1178: error: `r' undeclared (first use in this function)
ts_xlib.c:1178: warning: implicit declaration of function `XOpenIM'
ts_xlib.c:1178: error: `a0' undeclared (first use in this function)
ts_xlib.c:1178: error: `a1' undeclared (first use in this function)
ts_xlib.c:1178: error: `a2' undeclared (first use in this function)
ts_xlib.c:1178: error: `a3' undeclared (first use in this function)
ts_xlib.c: At top level:
ts_xlib.c:1183: error: parse error before "TSXCheckIfEvent"
ts_xlib.c:1183: error: parse error before '*' token
ts_xlib.c:1183: warning: type defaults to `int' in declaration of `TSXCheckIfEvent'
ts_xlib.c:1183: error: `TSXCheckIfEvent' declared as function returning a function
ts_xlib.c:1183: warning: type defaults to `int' in declaration of `XPointer'
ts_xlib.c:1183: error: parse error before "a3"
ts_xlib.c:1186: warning: type defaults to `int' in declaration of `wine_tsx11_lock'
ts_xlib.c:1186: error: `wine_tsx11_lock' redeclared as different kind of symbol
../include/ts_xlib.h:19: error: previous declaration of `wine_tsx11_lock'
ts_xlib.c:1186: warning: data definition has no type or storage class
ts_xlib.c:1187: warning: type defaults to `int' in declaration of `r'
ts_xlib.c:1187: error: `r' used prior to declaration
ts_xlib.c:1187: warning: implicit declaration of function `XCheckIfEvent'
ts_xlib.c:1187: error: `a0' undeclared here (not in a function)
ts_xlib.c:1187: error: `a1' undeclared here (not in a function)
ts_xlib.c:1187: error: `a2' undeclared here (not in a function)
ts_xlib.c:1187: error: `a3' undeclared here (not in a function)
ts_xlib.c:1187: error: initializer element is not constant
ts_xlib.c:1187: warning: data definition has no type or storage class
ts_xlib.c:1188: warning: type defaults to `int' in declaration of `wine_tsx11_unlock'
ts_xlib.c:1188: error: `wine_tsx11_unlock' redeclared as different kind of symbol
../include/ts_xlib.h:20: error: previous declaration of `wine_tsx11_unlock'
ts_xlib.c:1188: warning: data definition has no type or storage class
ts_xlib.c:1189: error: parse error before "return"
ts_xlib.c:1192: error: parse error before '*' token
ts_xlib.c:1192: error: parse error before '*' token
ts_xlib.c: In function `TSXSynchronize':
ts_xlib.c:1194: error: parse error before '*' token
ts_xlib.c:1196: warning: implicit declaration of function `XSynchronize'
ts_xlib.c:1196: error: `a0' undeclared (first use in this function)
ts_xlib.c:1196: error: `a1' undeclared (first use in this function)
ts_xlib.c:1196: warning: assignment makes pointer from integer without a cast
ts_xlib.c: At top level:
ts_xlib.c:1201: error: parse error before '*' token
ts_xlib.c:1203: error: parse error before '*' token
ts_xlib.c: In function `TS_XInitImageFuncPtrs':
ts_xlib.c:1206: error: `a0' undeclared (first use in this function)
make[1]: *** [ts_xlib.o] Error 1
make[1]: Leaving directory `/home/zero79/temp/cvswinex/winex/tsx11'
make: *** [tsx11/libwine_tsx11.so] Error 2
 
Old 05-01-2004, 09:36 AM   #5
zero79
Member
 
Registered: Nov 2003
Location: Ohio
Distribution: Debian Unstable
Posts: 460

Rep: Reputation: 30
ok, i figured it out. i needed to have the X windows development package installed ("apt-get install x-window-system-dev").
 
Old 05-02-2004, 08:22 AM   #6
Angelhide
LQ Newbie
 
Registered: May 2004
Posts: 6

Rep: Reputation: 0
I try to install winex cvs too and i have the same error as nbn792.

i try to install flex & flex-old and the error comes every time.
So i do like you dozero79 but it doesn t work.

what can i do ?
 
  


Reply


Thread Tools Search this Thread
Search this Thread:

Advanced Search

Posting Rules
You may not post new threads
You may not post replies
You may not post attachments
You may not edit your posts

BB code is On
Smilies are On
[IMG] code is Off
HTML code is Off



Similar Threads
Thread Thread Starter Forum Replies Last Post
Errors Installing winex using cvs script slacard Linux - Software 1 10-25-2004 10:51 PM
Problem installing Diablo II under Winex CVS lotana Linux - Newbie 4 03-18-2004 05:42 AM
Installing WINEX CVS cchgordon Linux - Games 1 03-02-2004 04:15 AM
What is CVS , wineX saurya_s Linux - Software 1 11-18-2003 01:14 PM
CVS and WineX Lord-Rashid Linux - Software 3 04-17-2003 06:38 PM

LinuxQuestions.org > Forums > Linux Forums > Linux - Software > Linux - Games

All times are GMT -5. The time now is 02:41 AM.

Main Menu
Advertisement
My LQ
Write for LQ
LinuxQuestions.org is looking for people interested in writing Editorials, Articles, Reviews, and more. If you'd like to contribute content, let us know.
Main Menu
Syndicate
RSS1  Latest Threads
RSS1  LQ News
Twitter: @linuxquestions
Facebook: linuxquestions Google+: linuxquestions
Open Source Consulting | Domain Registration