LinuxQuestions.org
Latest LQ Deal: Linux Power User Bundle
Go Back   LinuxQuestions.org > Forums > Linux Forums > Linux - Software > Linux - Games
User Name
Password
Linux - Games This forum is for all discussion relating to gaming in Linux.

Notices


Reply
  Search this Thread
Old 04-24-2004, 08:58 AM   #1
hyperion57070
LQ Newbie
 
Registered: Apr 2004
Posts: 5

Rep: Reputation: 0
Question Error during make (Steam with CVS)


Sorry if my english is not very good.....

In fact during the make, i have this message:
GetCVSWineX - Progress(u) : Green is current

0 = Uninstall
1 = Cleanup
2 = CVS checkout
3 = Configure
4 = Make depend
5 = Make
6 = Make install
7 = Finish up

-------------------------------------------

Compiling ...




--------- Error log - file /root/temp/cvswinex/ErrorLog : ---------
./ppl.l:1368: error: `debuglevel' undeclared (first use in this function)
./ppl.l:1368: error: `DEBUGLEVEL_PPLEX' undeclared (first use in this function)
./ppl.l:1370: error: `input_name' undeclared (first use in this function)
./ppl.l:1371: error: `line_number' undeclared (first use in this function)
./ppl.l:1378: error: `pp_macexp' undeclared (first use in this function)
./ppl.l: Hors de toute fonction :
./ppl.l:1386: attention : « macro_add_expansion » a été déclaré implicitement «
./ppl.l:1276: attention : déclaration précédente de « macro_add_expansion »
./ppl.l:1386: attention : type mismatch with previous implicit declaration
./ppl.l:1276: attention : previous implicit declaration of `macro_add_expansion'
./ppl.l:1386: attention : « macro_add_expansion » a été précédemment déclaré imp
./ppl.l: Dans la fonction « macro_add_expansion »:
./ppl.l:1387: error: `macexpstackentry_t' undeclared (first use in this function
./ppl.l:1387: error: `mep' undeclared (first use in this function)
./ppl.l:1396: error: `debuglevel' undeclared (first use in this function)
./ppl.l:1396: error: `DEBUGLEVEL_PPLEX' undeclared (first use in this function)
./ppl.l:1398: error: `input_name' undeclared (first use in this function)
./ppl.l:1399: error: `line_number' undeclared (first use in this function)
./ppl.l: Hors de toute fonction :
./ppl.l:1411: attention : « put_buffer » a été déclaré implicitement « extern »
./ppl.l:1151: attention : déclaration précédente de « put_buffer »
./ppl.l:1411: attention : type mismatch with previous implicit declaration
./ppl.l:1151: attention : previous implicit declaration of `put_buffer'
./ppl.l:1411: attention : « put_buffer » a été précédemment déclaré implicitemen
./ppl.l: Dans la fonction « put_buffer »:
./ppl.l:1415: error: `pass_data' undeclared (first use in this function)
./ppl.l: Dans la fonction « do_include »:
./ppl.l:1439: error: `includelogicentry_t' undeclared (first use in this functio
./ppl.l:1439: error: `iep' undeclared (first use in this function)
./ppl.l:1441: error: `includelogiclist' undeclared (first use in this function)
./ppl.l:1462: attention : implicit declaration of function `open_include'
./ppl.l:1462: attention : affectation transforme un entier en pointeur sans tran
./ppl.l:1467: error: `seen_junk' undeclared (first use in this function)
./ppl.l:1468: error: `include_state' undeclared (first use in this function)
./ppl.l:1469: error: `include_ppp' undeclared (first use in this function)
./ppl.l:1470: error: `pass_data' undeclared (first use in this function)
./ppl.l:1473: error: `debuglevel' undeclared (first use in this function)
./ppl.l:1473: error: `DEBUGLEVEL_PPMSG' undeclared (first use in this function)
./ppl.l:1474: error: `input_name' undeclared (first use in this function)
./ppl.l:1474: error: `line_number' undeclared (first use in this function)
./ppl.l:1474: error: `include_ifdepth' undeclared (first use in this function)
./ppl.l: Dans la fonction « push_ignore_state »:
./ppl.l:1488: error: `pp_ignore' undeclared (first use in this function)
./ppl.l: Hors de toute fonction :
lex.ppl.c:15101: attention : `yyunput' defined but not used
make[2]: *** [lex.ppl.o] Erreur 1
make[2]: quittant le répertoire « /root/temp/cvswinex/winex/tools/wrc »
make[1]: *** [wrc] Erreur 2
make[1]: quittant le répertoire « /root/temp/cvswinex/winex/tools »
make: *** [tools] Erreur 2


Error in Make

Try fixing the error based on the output above, and
run the script again, without paramaters (Eg: GetCVSWineX)

Do you have an idee about my problem ?
I have already tried with flex-old......
Thank a lot for your help !
 
Old 05-08-2004, 09:40 AM   #2
hyperion57070
LQ Newbie
 
Registered: Apr 2004
Posts: 5

Original Poster
Rep: Reputation: 0
Unhappy

Please help me......
what is my problem
 
  


Reply


Thread Tools Search this Thread
Search this Thread:

Advanced Search

Posting Rules
You may not post new threads
You may not post replies
You may not post attachments
You may not edit your posts

BB code is On
Smilies are On
[IMG] code is Off
HTML code is Off



Similar Threads
Thread Thread Starter Forum Replies Last Post
Wine CVS make/configure error trawler Linux - Software 0 10-31-2005 05:36 PM
error at make with winex cvs lonrot_m Linux - Software 1 03-07-2005 07:12 PM
Cant compile TuxKart CVS. Give out error, on make. RHLinuxGUY Linux - Games 5 11-15-2004 06:48 PM
Error in Make Depend while CVS install of WineX calmlikeabomb Mandriva 1 04-28-2004 06:46 PM
Steam on WineX cvs samhob Linux - Games 51 03-15-2004 08:00 PM

LinuxQuestions.org > Forums > Linux Forums > Linux - Software > Linux - Games

All times are GMT -5. The time now is 10:54 PM.

Main Menu
Advertisement
My LQ
Write for LQ
LinuxQuestions.org is looking for people interested in writing Editorials, Articles, Reviews, and more. If you'd like to contribute content, let us know.
Main Menu
Syndicate
RSS1  Latest Threads
RSS1  LQ News
Twitter: @linuxquestions
Facebook: linuxquestions Google+: linuxquestions
Open Source Consulting | Domain Registration