LinuxQuestions.org
Welcome to the most active Linux Forum on the web.
Go Back   LinuxQuestions.org > Forums > Linux Forums > Linux - Distributions > Linux From Scratch
User Name
Password
Linux From Scratch This Forum is for the discussion of LFS.
LFS is a project that provides you with the steps necessary to build your own custom Linux system.

Notices


Reply
  Search this Thread
Old 07-05-2012, 03:36 PM   #1
usef62
Member
 
Registered: Dec 2006
Posts: 50

Rep: Reputation: 15
python-kde4-4.6.0 Build Error


Hello
So here is the error I get when running "make"
on system: opensuse 11.4 x86 (i586)
gcc (SUSE Linux) 4.5.1 20101208

[ 34%] Building CXX object smoke/qt/qtcore/CMakeFiles/smokeqtcore.dir/smokedata.o
cd /home/usef/package/BUILD/kdebindings-4.6.0/build/smoke/qt/qtcore && /usr/bin/c++ -Dsmokeqtcore_EXPORTS -D_BSD_SOURCE -D_XOPEN_SOURCE=500 -D_BSD_SOURCE -DQT_NO_STL -DQT_NO_CAST_TO_ASCII -D_REENTRANT -DKDE_DEPRECATED_WARNINGS -DKDE4_CMAKE_TOPLEVEL_DIR_LENGTH=23 -DQT3_SUPPORT -DSMOKE_BUILDING -DGCC_VISIBILITY -O2 -g -m32 -march=i586 -mtune=i686 -fmessage-length=0 -D_FORTIFY_SOURCE=2 -fstack-protector -funwind-tables -fasynchronous-unwind-tables -Wnon-virtual-dtor -Wno-long-long -ansi -Wundef -Wcast-align -Wchar-subscripts -Wall -W -Wpointer-arith -Wformat-security -fno-exceptions -DQT_NO_EXCEPTIONS -fno-check-new -fno-common -Werror=return-type -Woverloaded-virtual -fno-threadsafe-statics -fvisibility=hidden -fvisibility-inlines-hidden -O2 -DNDEBUG -DQT_NO_DEBUG -fPIC -I/home/usef/package/BUILD/kdebindings-4.6.0/build/smoke/qt/qtcore -I/home/usef/package/BUILD/kdebindings-4.6.0/smoke/qt/qtcore -I/home/usef/package/BUILD/kdebindings-4.6.0 -I/home/usef/package/BUILD/kdebindings-4.6.0/build -I/home/usef/package/BUILD/kdebindings-4.6.0/smoke/qt -I/home/usef/package/BUILD/kdebindings-4.6.0/generator -I/home/usef/package/BUILD/kdebindings-4.6.0/smoke -I/home/usef/package/BUILD/kdebindings-4.6.0/smoke/qtcore -I/usr/include/KDE -I/usr/include/phonon -I/usr/include/QtXmlPatterns -I/usr/include/QtXml -I/usr/include/QtWebKit -I/usr/include/QtUiTools -I/usr/include/QtTest -I/usr/include/QtSvg -I/usr/include/QtSql -I/usr/include/QtScriptTools -I/usr/include/QtScript -I/usr/include/QtOpenGL -I/usr/include/QtNetwork -I/usr/include/QtMultimedia -I/usr/include/QtHelp -I/usr/include/QtDesigner -I/usr/include/QtDeclarative -I/usr/include/QtDBus -I/usr/include/QtAssistant -I/usr/include/Qt3Support -I/usr/include/QtGui -I/usr/include/QtCore -I/usr/include/Qt -I/usr/share/qt4/mkspecs/default -D_GNU_SOURCE -D_LARGEFILE64_SOURCE -D_FILE_OFFSET_BITS=64 -o CMakeFiles/smokeqtcore.dir/smokedata.o -c /home/usef/package/BUILD/kdebindings-4.6.0/build/smoke/qt/qtcore/smokedata.cpp
/home/usef/package/BUILD/kdebindings-4.6.0/build/smoke/qt/qtcore/smokedata.cpp: In function 'void* __smokeqtcore::cast(void*, Smoke::Index, Smoke::Index)':
/home/usef/package/BUILD/kdebindings-4.6.0/build/smoke/qt/qtcore/smokedata.cpp:918:34: error: '_Bit_iterator_base' was not declared in this scope
/home/usef/package/BUILD/kdebindings-4.6.0/build/smoke/qt/qtcore/smokedata.cpp:918:53: error: expected primary-expression before ')' token
/home/usef/package/BUILD/kdebindings-4.6.0/build/smoke/qt/qtcore/smokedata.cpp:918:55: error: '_Bit_const_iterator' was not declared in this scope
/home/usef/package/BUILD/kdebindings-4.6.0/build/smoke/qt/qtcore/smokedata.cpp:918:75: error: expected primary-expression before ')' token
/home/usef/package/BUILD/kdebindings-4.6.0/build/smoke/qt/qtcore/smokedata.cpp:918:76: error: expected ';' before 'xptr'
/home/usef/package/BUILD/kdebindings-4.6.0/build/smoke/qt/qtcore/smokedata.cpp:918:80: warning: statement has no effect
/home/usef/package/BUILD/kdebindings-4.6.0/build/smoke/qt/qtcore/smokedata.cpp:919:54: error: expected primary-expression before ')' token
/home/usef/package/BUILD/kdebindings-4.6.0/build/smoke/qt/qtcore/smokedata.cpp:919:55: error: expected ';' before 'xptr'
/home/usef/package/BUILD/kdebindings-4.6.0/build/smoke/qt/qtcore/smokedata.cpp:919:59: warning: statement has no effect
/home/usef/package/BUILD/kdebindings-4.6.0/build/smoke/qt/qtcore/smokedata.cpp:924:34: error: '_Bit_iterator_base' was not declared in this scope
/home/usef/package/BUILD/kdebindings-4.6.0/build/smoke/qt/qtcore/smokedata.cpp:924:53: error: expected primary-expression before ')' token
/home/usef/package/BUILD/kdebindings-4.6.0/build/smoke/qt/qtcore/smokedata.cpp:924:55: error: '_Bit_iterator' was not declared in this scope
/home/usef/package/BUILD/kdebindings-4.6.0/build/smoke/qt/qtcore/smokedata.cpp:924:69: error: expected primary-expression before ')' token
/home/usef/package/BUILD/kdebindings-4.6.0/build/smoke/qt/qtcore/smokedata.cpp:924:70: error: expected ';' before 'xptr'
/home/usef/package/BUILD/kdebindings-4.6.0/build/smoke/qt/qtcore/smokedata.cpp:924:74: warning: statement has no effect
/home/usef/package/BUILD/kdebindings-4.6.0/build/smoke/qt/qtcore/smokedata.cpp:925:48: error: expected primary-expression before ')' token
/home/usef/package/BUILD/kdebindings-4.6.0/build/smoke/qt/qtcore/smokedata.cpp:925:49: error: expected ';' before 'xptr'
/home/usef/package/BUILD/kdebindings-4.6.0/build/smoke/qt/qtcore/smokedata.cpp:925:53: warning: statement has no effect
/home/usef/package/BUILD/kdebindings-4.6.0/build/smoke/qt/qtcore/smokedata.cpp:930:34: error: '_Bit_iterator_base' was not declared in this scope
/home/usef/package/BUILD/kdebindings-4.6.0/build/smoke/qt/qtcore/smokedata.cpp:930:53: error: expected primary-expression before ')' token
/home/usef/package/BUILD/kdebindings-4.6.0/build/smoke/qt/qtcore/smokedata.cpp:930:54: error: expected ';' before 'xptr'
/home/usef/package/BUILD/kdebindings-4.6.0/build/smoke/qt/qtcore/smokedata.cpp:930:58: warning: statement has no effect
make[2]: *** [smoke/qt/qtcore/CMakeFiles/smokeqtcore.dir/smokedata.o] Error 1
make[2]: Leaving directory `/home/usef/package/BUILD/kdebindings-4.6.0/build'
make[1]: *** [smoke/qt/qtcore/CMakeFiles/smokeqtcore.dir/all] Error 2
make[1]: *** Waiting for unfinished jobs....
Linking CXX shared library ../../lib/pykde/plasma.so
cd /home/usef/package/BUILD/kdebindings-4.6.0/build/python/pykde4 && /usr/bin/cmake -E cmake_link_script CMakeFiles/python_module_PyKDE4_plasma.dir/link.txt --verbose=1
/usr/bin/c++ -fPIC -O2 -g -m32 -march=i586 -mtune=i686 -fmessage-length=0 -D_FORTIFY_SOURCE=2 -fstack-protector -funwind-tables -fasynchronous-unwind-tables -Wnon-virtual-dtor -Wno-long-long -ansi -Wundef -Wcast-align -Wchar-subscripts -Wall -W -Wpointer-arith -Wformat-security -fno-exceptions -DQT_NO_EXCEPTIONS -fno-check-new -fno-common -Werror=return-type -Woverloaded-virtual -fno-threadsafe-statics -fvisibility=hidden -fvisibility-inlines-hidden -O2 -DNDEBUG -DQT_NO_DEBUG -Wl,--enable-new-dtags -Wl,--fatal-warnings -Wl,--no-undefined -lc -Wl,-Bsymbolic-functions -shared -Wl,-soname,plasma.so -o ../../lib/pykde/plasma.so CMakeFiles/python_module_PyKDE4_plasma.dir/sip/plasma/sipplasmapart0.o CMakeFiles/python_module_PyKDE4_plasma.dir/sip/plasma/sipplasmapart1.o CMakeFiles/python_module_PyKDE4_plasma.dir/sip/plasma/sipplasmapart2.o CMakeFiles/python_module_PyKDE4_plasma.dir/sip/plasma/sipplasmapart3.o CMakeFiles/python_module_PyKDE4_plasma.dir/sip/plasma/sipplasmapart4.o CMakeFiles/python_module_PyKDE4_plasma.dir/sip/plasma/sipplasmapart5.o CMakeFiles/python_module_PyKDE4_plasma.dir/sip/plasma/sipplasmapart6.o CMakeFiles/python_module_PyKDE4_plasma.dir/sip/plasma/sipplasmapart7.o -lpython2.7 /usr/lib/libplasma.so.3.0.0 /usr/lib/libQtCore.so -lpthread /usr/lib/libQtGui.so /usr/lib/libQtUiTools.a /usr/lib/libkio.so.5.6.0 /usr/lib/libkdecore.so.5.6.0 /usr/lib/libkdeui.so.5.6.0 /usr/lib/libkio.so.5.6.0 /usr/lib/libQtNetwork.so /usr/lib/libQtXml.so /usr/lib/libkdeui.so.5.6.0 /usr/lib/libQtGui.so /usr/lib/libkdecore.so.5.6.0 /usr/lib/libQtCore.so -lpthread /usr/lib/libQtDBus.so /usr/lib/libQtSvg.so
make[2]: Leaving directory `/home/usef/package/BUILD/kdebindings-4.6.0/build'
/usr/bin/cmake -E cmake_progress_report /home/usef/package/BUILD/kdebindings-4.6.0/build/CMakeFiles 29 30
[ 34%] Built target python_module_PyKDE4_plasma
make[1]: Leaving directory `/home/usef/package/BUILD/kdebindings-4.6.0/build'
make: *** [all] Error 2
 
  


Reply


Thread Tools Search this Thread
Search this Thread:

Advanced Search

Posting Rules
You may not post new threads
You may not post replies
You may not post attachments
You may not edit your posts

BB code is On
Smilies are On
[IMG] code is Off
HTML code is Off



Similar Threads
Thread Thread Starter Forum Replies Last Post
Python 2.6 dependencies error installing python-sqlite2-2.5.5-1.1.i586.rpm jmp007 Linux - Newbie 1 02-11-2011 12:05 PM
[SOLVED] Slackware-current python upgrade breaks kde4 printer module tux_dude Slackware 3 12-02-2010 11:38 PM
Build ONLY python interpreter tank junior Linux - Newbie 1 12-02-2010 07:09 PM
python-kde4: Depends: python-sip4 (>= <none>)??? replica9000 Debian 14 05-03-2010 08:42 AM
Order to build KDE4 deps dugan Slackware 21 01-12-2009 08:44 PM

LinuxQuestions.org > Forums > Linux Forums > Linux - Distributions > Linux From Scratch

All times are GMT -5. The time now is 04:48 AM.

Main Menu
Advertisement
My LQ
Write for LQ
LinuxQuestions.org is looking for people interested in writing Editorials, Articles, Reviews, and more. If you'd like to contribute content, let us know.
Main Menu
Syndicate
RSS1  Latest Threads
RSS1  LQ News
Twitter: @linuxquestions
Open Source Consulting | Domain Registration