-   Linux From Scratch (
-   -   error : make-3.82 Lfs 7.1 chapter 6 (

nourib 07-29-2012 04:44 PM

error : make-3.82 Lfs 7.1 chapter 6
i get error during the commend make check


1 Test in 1 Category Failed (See .diff files in work dir for details) :-(

make[2]: *** [check-regression] Error 1
make[2]: Leaving directory `/sources/lfs7p1/make-3.82'
make[1]: *** [check-am] Error 2
make[1]: Leaving directory `/sources/lfs7p1/make-3.82'
make: *** [check-recursive] Error 1
when i try to find the .diff files

root:/sources/lfs7p1/make-3.82# ls
i get


ABOUT-NLS ar.c dep.h job.c remote-stub.o
AUTHORS ar.o dir.c job.h rule.c
COPYING arscan.c dir.o job.o rule.h
ChangeLog arscan.o doc loadavg rule.o
INSTALL dosbuild.bat loadavg-getloadavg.o signame.c
Makefile expand.c main.c signame.o
Makefile.DOS build_w32.bat expand.o main.o stamp-h1 commands.c file.c make strcache.c
Makefile.ami commands.h file.o make.1 strcache.o commands.o filedef.h make.h subproc.bat
NEWS config function.c make.lnk tests
NMakefile config.ami function.o make_msvc_net2003.sln variable.c
README config.h getloadavg.c make_msvc_net2003.vcproj variable.h
README.Amiga config.h-vms getopt.c variable.o
README.DOS config.h.W32 getopt.h makefile.vms version.c
README.OS2 getopt.o misc.c version.o
README.W32 config.log getopt1.c misc.o vmsdir.h
README.customs config.status getopt1.o po vmsfunctions.c
SCOPTIONS configh.dos gettext.h read.c vmsify.c
SMakefile configure glob read.o vmsjobs.c
acinclude.m4 configure.bat hash.c readme.vms vpath.c
aclocal.m4 hash.h remake.c vpath.o
alloca.c debug.h hash.o remake.o w32
amiga.c default.c implicit.c remote-cstms.c
amiga.h default.o implicit.o remote-stub.c

can any one help me please

druuna 07-30-2012 04:30 AM

Please post the actual error. What you posted only shows that an error occurred, not which error ocured (have a look here: [1.5.3]).

The aforementioned work directory is probably also mentioned in the actual error.

All times are GMT -5. The time now is 12:37 PM.