LinuxQuestions.org
Share your knowledge at the LQ Wiki.
Go Back   LinuxQuestions.org > Forums > Linux Forums > Linux - Distributions
User Name
Password
Linux - Distributions This forum is for Distribution specific questions.
Red Hat, Slackware, Debian, Novell, LFS, Mandriva, Ubuntu, Fedora - the list goes on and on... Note: An (*) indicates there is no official participation from that distribution here at LQ.

Notices


Reply
  Search this Thread
Old 12-05-2018, 09:53 PM   #1
James Baldwin
LQ Newbie
 
Registered: Dec 2018
Posts: 1

Rep: Reputation: Disabled
Question error in installing ns-allinone-2.35 in Ubuntu18.04


Holle!
I am getting following error while installing ns-allinone-2.35 in UBUNTU18.04. please provide the solution for this, as i am new for this :


mdart/mdart_adp.cc: In member function ‘void ADP::sendDarq(nsaddr_t, int)’:
mdart/mdart_adp.cc:108:21: error: reference to ‘hash’ is ambiguous
nsaddr_t dstAdd_ = hash(reqId);
^~~~
In file included from ./mdart/mdart.h:52:0,
from ./mdart/mdart_adp.h:51,
from mdart/mdart_adp.cc:47:
./mdart/mdart_function.h:230:17: note: candidates are: nsaddr_t hash(nsaddr_t)
inline nsaddr_t hash(nsaddr_t id) {
^~~~
In file included from /usr/include/c++/7/bits/basic_string.h:6578:0,
from /usr/include/c++/7/string:52,
from /usr/include/c++/7/bitset:47,
from ./mdart/mdart_function.h:62,
from ./mdart/mdart.h:52,
from ./mdart/mdart_adp.h:51,
from mdart/mdart_adp.cc:47:
/usr/include/c++/7/bits/functional_hash.h:58:12: note: template<class _Tp> struct std::hash
struct hash;
^~~~
mdart/mdart_adp.cc: In member function ‘void ADP::sendDaup()’:
mdart/mdart_adp.cc:396:21: error: reference to ‘hash’ is ambiguous
nsaddr_t dstAdd_ = hash(mdart_->id_);
^~~~
In file included from ./mdart/mdart.h:52:0,
from ./mdart/mdart_adp.h:51,
from mdart/mdart_adp.cc:47:
./mdart/mdart_function.h:230:17: note: candidates are: nsaddr_t hash(nsaddr_t)
inline nsaddr_t hash(nsaddr_t id) {
^~~~
In file included from /usr/include/c++/7/bits/basic_string.h:6578:0,
from /usr/include/c++/7/string:52,
from /usr/include/c++/7/bitset:47,
from ./mdart/mdart_function.h:62,
from ./mdart/mdart.h:52,
from ./mdart/mdart_adp.h:51,
from mdart/mdart_adp.cc:47:
/usr/include/c++/7/bits/functional_hash.h:58:12: note: template<class _Tp> struct std::hash
struct hash;
^~~~
Makefile:93: recipe for target 'mdart/mdart_adp.o' failed
make: *** [mdart/mdart_adp.o] Error 1
Ns make failed!
See http://www.isi.edu/nsnam/ns/ns-problems.html for problems
 
  


Reply


Thread Tools Search this Thread
Search this Thread:

Advanced Search

Posting Rules
You may not post new threads
You may not post replies
You may not post attachments
You may not edit your posts

BB code is On
Smilies are On
[IMG] code is Off
HTML code is Off



Similar Threads
Thread Thread Starter Forum Replies Last Post
[SOLVED] error in installing ns-allinone-2.35 in fedora 27 Uday J Linux - Software 5 01-21-2018 01:16 PM
error in installing ns-allinone-2.35 in fedora 27 Uday J Fedora 1 01-21-2018 07:59 AM
[SOLVED] Error while installing ns-allinone-2.29 on windows nkokos Linux - Newbie 3 03-02-2013 04:27 AM
I am getting problem in nam-1.11 while installing ns-allinone-2.29 on fedora core 5 deodutta Linux - General 0 02-03-2007 11:38 PM

LinuxQuestions.org > Forums > Linux Forums > Linux - Distributions

All times are GMT -5. The time now is 08:34 PM.

Main Menu
Advertisement
My LQ
Write for LQ
LinuxQuestions.org is looking for people interested in writing Editorials, Articles, Reviews, and more. If you'd like to contribute content, let us know.
Main Menu
Syndicate
RSS1  Latest Threads
RSS1  LQ News
Twitter: @linuxquestions
Facebook: linuxquestions Google+: linuxquestions
Open Source Consulting | Domain Registration