LinuxQuestions.org
View the Most Wanted LQ Wiki articles.
Go Back   LinuxQuestions.org > Forums > Linux Forums > Linux - Distributions > Suse/Novell
User Name
Password
Suse/Novell This Forum is for the discussion of Suse Linux.

Notices



Reply
 
Search this Thread
Old 05-08-2005, 02:08 AM   #1
jimbrook
Member
 
Registered: Apr 2005
Posts: 39

Rep: Reputation: 15
SuSE error message on 'make'


suSE 9.2
trying to install the ralink 2500 driver and get the following error message:

am trying to make the driver for the ralink 2500 wireless chipset. When I try to 'make' the driver I get the following errors Im a newbie. Can anyone help? I'm running SuSE 9.2.

linux:/usr/src/rt2500-1.1.0/Utilitys # cd /usr/src/rt2500-1.1.0/Module
linux:/usr/src/rt2500-1.1.0/Module # make
make[1]: Entering directory `/usr/src/linux-2.6.8-24-obj/i386/default'
make -C ../../../linux-2.6.8-24 O=../linux-2.6.8-24-obj/i386/default modules
/usr/src/linux-2.6.8-24/scripts/gcc-version.sh: line 11: gcc: command not found
/usr/src/linux-2.6.8-24/scripts/gcc-version.sh: line 12: gcc: command not found
CC [M] /usr/src/rt2500-1.1.0/Module/rtmp_main.o
/bin/sh: gcc: command not found
make[4]: *** [/usr/src/rt2500-1.1.0/Module/rtmp_main.o] Error 127
make[3]: *** [_module_/usr/src/rt2500-1.1.0/Module] Error 2
make[2]: *** [modules] Error 2
make[1]: *** [modules] Error 2
make[1]: Leaving directory `/usr/src/linux-2.6.8-24-obj/i386/default'
rt2500.ko failed to build!
make: *** [module] Error 1
linux:/usr/src/rt2500-1.1.0/Module #

Any help would be appreciated....
 
Old 05-08-2005, 02:32 AM   #2
pcandpc
Member
 
Registered: Apr 2005
Posts: 241

Rep: Reputation: 30
Hi,

Usually, the make utility takes the name of
a script file as an argument; e.g. "make install",
where "install" is a script file that contains some
shell commands.

Also, from your error messages, I'm curious if
you installed "development" packages in your
SuSE 9.2.

Good luck.
 
Old 05-08-2005, 03:06 AM   #3
jimbrook
Member
 
Registered: Apr 2005
Posts: 39

Original Poster
Rep: Reputation: 15
Thanks. I just realized I did not have gcc installed.
 
  


Reply


Thread Tools Search this Thread
Search this Thread:

Advanced Search

Posting Rules
You may not post new threads
You may not post replies
You may not post attachments
You may not edit your posts

BB code is On
Smilies are On
[IMG] code is Off
HTML code is Off


Similar Threads
Thread Thread Starter Forum Replies Last Post
libxine1 conflict & error message on Suse? suse2166 Linux - Software 2 07-11-2005 04:53 PM
Why i m getting the following error message "make[3]: *** [tcl_ovsec_kadm.o] Error 1" shanu Linux - Software 1 03-10-2005 12:54 PM
CD Kreator (KDE K3B) error message on Suse 9.2 suse2166 Linux - Software 9 01-23-2005 01:57 PM
Wine make help! error message included Jmcatch742 Linux - Software 0 11-17-2004 08:55 PM
ndiswrapper make error SUSE 9.1 RandallC Linux - Wireless Networking 21 10-13-2004 06:25 PM


All times are GMT -5. The time now is 10:46 AM.

Main Menu
Advertisement
My LQ
Write for LQ
LinuxQuestions.org is looking for people interested in writing Editorials, Articles, Reviews, and more. If you'd like to contribute content, let us know.
Main Menu
Syndicate
RSS1  Latest Threads
RSS1  LQ News
Twitter: @linuxquestions
identi.ca: @linuxquestions
Facebook: linuxquestions Google+: linuxquestions
Open Source Consulting | Domain Registration