LinuxQuestions.org
Support LQ: Use code LQ3 and save $3 on Domain Registration
Go Back   LinuxQuestions.org > Forums > Linux Forums > Linux - Distributions > Slackware
User Name
Password
Slackware This Forum is for the discussion of Slackware Linux.

Notices

Reply
 
Search this Thread
Old 04-09-2013, 07:24 PM   #1
frushiyama
Member
 
Registered: Oct 2010
Location: Brazil
Distribution: Slackware64 14.1, Slackware ARM
Posts: 53

Rep: Reputation: 1
Update chromium slackbuild


I tried to build using the latest stable version of chromium source (26.0.1410.63) on Slackware64 current and got these erros, even if a try to use gold linker:
Code:
root@darkstar:/usr/src/chromium# ./chromium.Slackbuild 
chmod: cannot operate on dangling symlink './build/android/arm-linux-androideabi-gold/arm-linux-androideabi-ld'
chmod: cannot operate on dangling symlink './build/android/arm-linux-androideabi-gold/ld'
chmod: cannot operate on dangling symlink './third_party/openssl/openssl/test/fips_aesavs.c'
chmod: cannot operate on dangling symlink './third_party/openssl/openssl/test/fips_hmactest.c'
chmod: cannot operate on dangling symlink './third_party/openssl/openssl/test/fips_dssvs.c'
chmod: cannot operate on dangling symlink './third_party/openssl/openssl/test/fips_desmovs.c'
chmod: cannot operate on dangling symlink './third_party/openssl/openssl/test/fips_test_suite.c'
chmod: cannot operate on dangling symlink './third_party/openssl/openssl/test/fips_rsagtest.c'
chmod: cannot operate on dangling symlink './third_party/openssl/openssl/test/fips_randtest.c'
chmod: cannot operate on dangling symlink './third_party/openssl/openssl/test/fips_rsavtest.c'
chmod: cannot operate on dangling symlink './third_party/openssl/openssl/test/fips_shatest.c'
chmod: cannot operate on dangling symlink './third_party/openssl/openssl/test/fips_rngvs.c'
chmod: cannot operate on dangling symlink './third_party/openssl/openssl/test/fips_rsastest.c'
chmod: cannot operate on dangling symlink './third_party/openssl/openssl/test/fips_dsatest.c'
patching file chrome/browser/memory_details_linux.cc
patch unexpectedly ends in middle of line
Hunk #1 FAILED at 14.
1 out of 1 hunk FAILED -- saving rejects to file chrome/browser/memory_details_linux.cc.rej
root@darkstar:/usr/src/chromium# rm /usr/bin/ld
ld           ld.gold      ldapadd      ldapdelete   ldapmodify   ldappasswd   ldapurl      ldd          
ld.bfd       ld86         ldapcompare  ldapexop     ldapmodrdn   ldapsearch   ldapwhoami   lddlibc4     
root@darkstar:/usr/src/chromium# rm /usr/bin/ld
root@darkstar:/usr/src/chromium# ln -s /usr/bin/ld.gold /usr/bin/ld
root@darkstar:/usr/src/chromium# ./chromium.Slackbuild 
chmod: cannot operate on dangling symlink './build/android/arm-linux-androideabi-gold/arm-linux-androideabi-ld'
chmod: cannot operate on dangling symlink './build/android/arm-linux-androideabi-gold/ld'
chmod: cannot operate on dangling symlink './third_party/openssl/openssl/test/fips_aesavs.c'
chmod: cannot operate on dangling symlink './third_party/openssl/openssl/test/fips_hmactest.c'
chmod: cannot operate on dangling symlink './third_party/openssl/openssl/test/fips_dssvs.c'
chmod: cannot operate on dangling symlink './third_party/openssl/openssl/test/fips_desmovs.c'
chmod: cannot operate on dangling symlink './third_party/openssl/openssl/test/fips_test_suite.c'
chmod: cannot operate on dangling symlink './third_party/openssl/openssl/test/fips_rsagtest.c'
chmod: cannot operate on dangling symlink './third_party/openssl/openssl/test/fips_randtest.c'
chmod: cannot operate on dangling symlink './third_party/openssl/openssl/test/fips_rsavtest.c'
chmod: cannot operate on dangling symlink './third_party/openssl/openssl/test/fips_shatest.c'
chmod: cannot operate on dangling symlink './third_party/openssl/openssl/test/fips_rngvs.c'
chmod: cannot operate on dangling symlink './third_party/openssl/openssl/test/fips_rsastest.c'
chmod: cannot operate on dangling symlink './third_party/openssl/openssl/test/fips_dsatest.c'
patching file chrome/browser/memory_details_linux.cc
patch unexpectedly ends in middle of line
Hunk #1 FAILED at 14.
1 out of 1 hunk FAILED -- saving rejects to file chrome/browser/memory_details_linux.cc.rej
Any hint on how to update the slackbuild? I changed the line for unpack the tar.xz source and the version line too.

Last edited by frushiyama; 04-10-2013 at 06:21 AM.
 
Old 04-09-2013, 09:03 PM   #2
willysr
Senior Member
 
Registered: Jul 2004
Location: Jogja, Indonesia
Distribution: Slackware-Current
Posts: 2,568

Rep: Reputation: 426Reputation: 426Reputation: 426Reputation: 426Reputation: 426
Try removing the patch
Probably it has been included upstream
 
Old 04-09-2013, 10:00 PM   #3
frushiyama
Member
 
Registered: Oct 2010
Location: Brazil
Distribution: Slackware64 14.1, Slackware ARM
Posts: 53

Original Poster
Rep: Reputation: 1
I commented out the line that calls the patch, now i'm getting this erros, again with ld.bfd and ld.gold:
Code:
root@darkstar:/usr/src/chromium# ./chromium.Slackbuild 
chmod: cannot operate on dangling symlink './build/android/arm-linux-androideabi-gold/arm-linux-androideabi-ld'
chmod: cannot operate on dangling symlink './build/android/arm-linux-androideabi-gold/ld'
chmod: cannot operate on dangling symlink './third_party/openssl/openssl/test/fips_aesavs.c'
chmod: cannot operate on dangling symlink './third_party/openssl/openssl/test/fips_hmactest.c'
chmod: cannot operate on dangling symlink './third_party/openssl/openssl/test/fips_dssvs.c'
chmod: cannot operate on dangling symlink './third_party/openssl/openssl/test/fips_desmovs.c'
chmod: cannot operate on dangling symlink './third_party/openssl/openssl/test/fips_test_suite.c'
chmod: cannot operate on dangling symlink './third_party/openssl/openssl/test/fips_rsagtest.c'
chmod: cannot operate on dangling symlink './third_party/openssl/openssl/test/fips_randtest.c'
chmod: cannot operate on dangling symlink './third_party/openssl/openssl/test/fips_rsavtest.c'
chmod: cannot operate on dangling symlink './third_party/openssl/openssl/test/fips_shatest.c'
chmod: cannot operate on dangling symlink './third_party/openssl/openssl/test/fips_rngvs.c'
chmod: cannot operate on dangling symlink './third_party/openssl/openssl/test/fips_rsastest.c'
chmod: cannot operate on dangling symlink './third_party/openssl/openssl/test/fips_dsatest.c'
Updating projects from gyp files...
  g++ '-D_FILE_OFFSET_BITS=64' '-DUSE_LINUX_BREAKPAD' '-DDISABLE_NACL' '-DCHROMIUM_BUILD' '-DUSE_DEFAULT_RENDER_THEME=1' '-DUSE_LIBJPEG_TURBO=1' '-DUSE_NSS=1' '-DENABLE_ONE_CLICK_SIGNIN' '-DGTK_DISABLE_SINGLE_INCLUDES=1' '-DENABLE_REMOTING=1' '-DENABLE_WEBRTC=1' '-DUSE_PROPRIETARY_CODECS' '-DENABLE_PEPPER_THREADING' '-DENABLE_CONFIGURATION_POLICY' '-DENABLE_INPUT_SPEECH' '-DENABLE_NOTIFICATIONS' '-DENABLE_GPU=1' '-DENABLE_EGLIMAGE=1' '-DUSE_SKIA=1' '-DENABLE_TASK_MANAGER=1' '-DENABLE_EXTENSIONS=1' '-DENABLE_PLUGIN_INSTALLATION=1' '-DENABLE_PLUGINS=1' '-DENABLE_SESSION_SERVICE=1' '-DENABLE_THEMES=1' '-DENABLE_BACKGROUND=1' '-DENABLE_AUTOMATION=1' '-DENABLE_GOOGLE_NOW=1' '-DENABLE_LANGUAGE_DETECTION=1' '-DENABLE_PRINTING=1' '-DENABLE_CAPTIVE_PORTAL_DETECTION=1' '-DENABLE_MANAGED_USERS=1' '-DNO_HEAP_CHECK' '-DNDEBUG' '-DNVALGRIND' '-DDYNAMIC_ANNOTATIONS_ENABLED=0' -Ibase/allocator -Ithird_party/tcmalloc/chromium/src/base -Ithird_party/tcmalloc/chromium/src -I.  -fstack-protector --param=ssp-buffer-size=4 -pthread -fno-exceptions -fno-strict-aliasing -Wno-unused-parameter -Wno-missing-field-initializers -pipe -fPIC -Wno-sign-compare -Wno-unused-result -Wno-format -Wno-unused-result -O2 -fno-ident -fdata-sections -ffunction-sections -O2 -fPIC -fno-rtti -fno-threadsafe-statics -fvisibility-inlines-hidden -Wno-deprecated -MMD -MF out/Release/.deps/out/Release/obj.target/allocator/third_party/tcmalloc/chromium/src/base/abort.o.d.raw  -c -o out/Release/obj.target/allocator/third_party/tcmalloc/chromium/src/base/abort.o third_party/tcmalloc/chromium/src/base/abort.cc
  g++ '-D_FILE_OFFSET_BITS=64' '-DUSE_LINUX_BREAKPAD' '-DDISABLE_NACL' '-DCHROMIUM_BUILD' '-DUSE_DEFAULT_RENDER_THEME=1' '-DUSE_LIBJPEG_TURBO=1' '-DUSE_NSS=1' '-DENABLE_ONE_CLICK_SIGNIN' '-DGTK_DISABLE_SINGLE_INCLUDES=1' '-DENABLE_REMOTING=1' '-DENABLE_WEBRTC=1' '-DUSE_PROPRIETARY_CODECS' '-DENABLE_PEPPER_THREADING' '-DENABLE_CONFIGURATION_POLICY' '-DENABLE_INPUT_SPEECH' '-DENABLE_NOTIFICATIONS' '-DENABLE_GPU=1' '-DENABLE_EGLIMAGE=1' '-DUSE_SKIA=1' '-DENABLE_TASK_MANAGER=1' '-DENABLE_EXTENSIONS=1' '-DENABLE_PLUGIN_INSTALLATION=1' '-DENABLE_PLUGINS=1' '-DENABLE_SESSION_SERVICE=1' '-DENABLE_THEMES=1' '-DENABLE_BACKGROUND=1' '-DENABLE_AUTOMATION=1' '-DENABLE_GOOGLE_NOW=1' '-DENABLE_LANGUAGE_DETECTION=1' '-DENABLE_PRINTING=1' '-DENABLE_CAPTIVE_PORTAL_DETECTION=1' '-DENABLE_MANAGED_USERS=1' '-DNO_HEAP_CHECK' '-DNDEBUG' '-DNVALGRIND' '-DDYNAMIC_ANNOTATIONS_ENABLED=0' -Ibase/allocator -Ithird_party/tcmalloc/chromium/src/base -Ithird_party/tcmalloc/chromium/src -I.  -fstack-protector --param=ssp-buffer-size=4 -pthread -fno-exceptions -fno-strict-aliasing -Wno-unused-parameter -Wno-missing-field-initializers -pipe -fPIC -Wno-sign-compare -Wno-unused-result -Wno-format -Wno-unused-result -O2 -fno-ident -fdata-sections -ffunction-sections -O2 -fPIC -fno-rtti -fno-threadsafe-statics -fvisibility-inlines-hidden -Wno-deprecated -MMD -MF out/Release/.deps/out/Release/obj.target/allocator/third_party/tcmalloc/chromium/src/base/elf_mem_image.o.d.raw  -c -o out/Release/obj.target/allocator/third_party/tcmalloc/chromium/src/base/elf_mem_image.o third_party/tcmalloc/chromium/src/base/elf_mem_image.cc
  g++ '-D_FILE_OFFSET_BITS=64' '-DUSE_LINUX_BREAKPAD' '-DDISABLE_NACL' '-DCHROMIUM_BUILD' '-DUSE_DEFAULT_RENDER_THEME=1' '-DUSE_LIBJPEG_TURBO=1' '-DUSE_NSS=1' '-DENABLE_ONE_CLICK_SIGNIN' '-DGTK_DISABLE_SINGLE_INCLUDES=1' '-DENABLE_REMOTING=1' '-DENABLE_WEBRTC=1' '-DUSE_PROPRIETARY_CODECS' '-DENABLE_PEPPER_THREADING' '-DENABLE_CONFIGURATION_POLICY' '-DENABLE_INPUT_SPEECH' '-DENABLE_NOTIFICATIONS' '-DENABLE_GPU=1' '-DENABLE_EGLIMAGE=1' '-DUSE_SKIA=1' '-DENABLE_TASK_MANAGER=1' '-DENABLE_EXTENSIONS=1' '-DENABLE_PLUGIN_INSTALLATION=1' '-DENABLE_PLUGINS=1' '-DENABLE_SESSION_SERVICE=1' '-DENABLE_THEMES=1' '-DENABLE_BACKGROUND=1' '-DENABLE_AUTOMATION=1' '-DENABLE_GOOGLE_NOW=1' '-DENABLE_LANGUAGE_DETECTION=1' '-DENABLE_PRINTING=1' '-DENABLE_CAPTIVE_PORTAL_DETECTION=1' '-DENABLE_MANAGED_USERS=1' '-DNO_HEAP_CHECK' '-DNDEBUG' '-DNVALGRIND' '-DDYNAMIC_ANNOTATIONS_ENABLED=0' -Ibase/allocator -Ithird_party/tcmalloc/chromium/src/base -Ithird_party/tcmalloc/chromium/src -I.  -fstack-protector --param=ssp-buffer-size=4 -pthread -fno-exceptions -fno-strict-aliasing -Wno-unused-parameter -Wno-missing-field-initializers -pipe -fPIC -Wno-sign-compare -Wno-unused-result -Wno-format -Wno-unused-result -O2 -fno-ident -fdata-sections -ffunction-sections -O2 -fPIC -fno-rtti -fno-threadsafe-statics -fvisibility-inlines-hidden -Wno-deprecated -MMD -MF out/Release/.deps/out/Release/obj.target/allocator/third_party/tcmalloc/chromium/src/base/linuxthreads.o.d.raw  -c -o out/Release/obj.target/allocator/third_party/tcmalloc/chromium/src/base/linuxthreads.o third_party/tcmalloc/chromium/src/base/linuxthreads.cc
  g++ '-D_FILE_OFFSET_BITS=64' '-DUSE_LINUX_BREAKPAD' '-DDISABLE_NACL' '-DCHROMIUM_BUILD' '-DUSE_DEFAULT_RENDER_THEME=1' '-DUSE_LIBJPEG_TURBO=1' '-DUSE_NSS=1' '-DENABLE_ONE_CLICK_SIGNIN' '-DGTK_DISABLE_SINGLE_INCLUDES=1' '-DENABLE_REMOTING=1' '-DENABLE_WEBRTC=1' '-DUSE_PROPRIETARY_CODECS' '-DENABLE_PEPPER_THREADING' '-DENABLE_CONFIGURATION_POLICY' '-DENABLE_INPUT_SPEECH' '-DENABLE_NOTIFICATIONS' '-DENABLE_GPU=1' '-DENABLE_EGLIMAGE=1' '-DUSE_SKIA=1' '-DENABLE_TASK_MANAGER=1' '-DENABLE_EXTENSIONS=1' '-DENABLE_PLUGIN_INSTALLATION=1' '-DENABLE_PLUGINS=1' '-DENABLE_SESSION_SERVICE=1' '-DENABLE_THEMES=1' '-DENABLE_BACKGROUND=1' '-DENABLE_AUTOMATION=1' '-DENABLE_GOOGLE_NOW=1' '-DENABLE_LANGUAGE_DETECTION=1' '-DENABLE_PRINTING=1' '-DENABLE_CAPTIVE_PORTAL_DETECTION=1' '-DENABLE_MANAGED_USERS=1' '-DNO_HEAP_CHECK' '-DNDEBUG' '-DNVALGRIND' '-DDYNAMIC_ANNOTATIONS_ENABLED=0' -Ibase/allocator -Ithird_party/tcmalloc/chromium/src/base -Ithird_party/tcmalloc/chromium/src -I.  -fstack-protector --param=ssp-buffer-size=4 -pthread -fno-exceptions -fno-strict-aliasing -Wno-unused-parameter -Wno-missing-field-initializers -pipe -fPIC -Wno-sign-compare -Wno-unused-result -Wno-format -Wno-unused-result -O2 -fno-ident -fdata-sections -ffunction-sections -O2 -fPIC -fno-rtti -fno-threadsafe-statics -fvisibility-inlines-hidden -Wno-deprecated -MMD -MF out/Release/.deps/out/Release/obj.target/allocator/third_party/tcmalloc/chromium/src/base/logging.o.d.raw  -c -o out/Release/obj.target/allocator/third_party/tcmalloc/chromium/src/base/logging.o third_party/tcmalloc/chromium/src/base/logging.cc
  g++ '-D_FILE_OFFSET_BITS=64' '-DUSE_LINUX_BREAKPAD' '-DDISABLE_NACL' '-DCHROMIUM_BUILD' '-DUSE_DEFAULT_RENDER_THEME=1' '-DUSE_LIBJPEG_TURBO=1' '-DUSE_NSS=1' '-DENABLE_ONE_CLICK_SIGNIN' '-DGTK_DISABLE_SINGLE_INCLUDES=1' '-DENABLE_REMOTING=1' '-DENABLE_WEBRTC=1' '-DUSE_PROPRIETARY_CODECS' '-DENABLE_PEPPER_THREADING' '-DENABLE_CONFIGURATION_POLICY' '-DENABLE_INPUT_SPEECH' '-DENABLE_NOTIFICATIONS' '-DENABLE_GPU=1' '-DENABLE_EGLIMAGE=1' '-DUSE_SKIA=1' '-DENABLE_TASK_MANAGER=1' '-DENABLE_EXTENSIONS=1' '-DENABLE_PLUGIN_INSTALLATION=1' '-DENABLE_PLUGINS=1' '-DENABLE_SESSION_SERVICE=1' '-DENABLE_THEMES=1' '-DENABLE_BACKGROUND=1' '-DENABLE_AUTOMATION=1' '-DENABLE_GOOGLE_NOW=1' '-DENABLE_LANGUAGE_DETECTION=1' '-DENABLE_PRINTING=1' '-DENABLE_CAPTIVE_PORTAL_DETECTION=1' '-DENABLE_MANAGED_USERS=1' '-DNO_HEAP_CHECK' '-DNDEBUG' '-DNVALGRIND' '-DDYNAMIC_ANNOTATIONS_ENABLED=0' -Ibase/allocator -Ithird_party/tcmalloc/chromium/src/base -Ithird_party/tcmalloc/chromium/src -I.  -fstack-protector --param=ssp-buffer-size=4 -pthread -fno-exceptions -fno-strict-aliasing -Wno-unused-parameter -Wno-missing-field-initializers -pipe -fPIC -Wno-sign-compare -Wno-unused-result -Wno-format -Wno-unused-result -O2 -fno-ident -fdata-sections -ffunction-sections -O2 -fPIC -fno-rtti -fno-threadsafe-statics -fvisibility-inlines-hidden -Wno-deprecated -MMD -MF out/Release/.deps/out/Release/obj.target/allocator/third_party/tcmalloc/chromium/src/base/low_level_alloc.o.d.raw  -c -o out/Release/obj.target/allocator/third_party/tcmalloc/chromium/src/base/low_level_alloc.o third_party/tcmalloc/chromium/src/base/low_level_alloc.cc
  g++ '-D_FILE_OFFSET_BITS=64' '-DUSE_LINUX_BREAKPAD' '-DDISABLE_NACL' '-DCHROMIUM_BUILD' '-DUSE_DEFAULT_RENDER_THEME=1' '-DUSE_LIBJPEG_TURBO=1' '-DUSE_NSS=1' '-DENABLE_ONE_CLICK_SIGNIN' '-DGTK_DISABLE_SINGLE_INCLUDES=1' '-DENABLE_REMOTING=1' '-DENABLE_WEBRTC=1' '-DUSE_PROPRIETARY_CODECS' '-DENABLE_PEPPER_THREADING' '-DENABLE_CONFIGURATION_POLICY' '-DENABLE_INPUT_SPEECH' '-DENABLE_NOTIFICATIONS' '-DENABLE_GPU=1' '-DENABLE_EGLIMAGE=1' '-DUSE_SKIA=1' '-DENABLE_TASK_MANAGER=1' '-DENABLE_EXTENSIONS=1' '-DENABLE_PLUGIN_INSTALLATION=1' '-DENABLE_PLUGINS=1' '-DENABLE_SESSION_SERVICE=1' '-DENABLE_THEMES=1' '-DENABLE_BACKGROUND=1' '-DENABLE_AUTOMATION=1' '-DENABLE_GOOGLE_NOW=1' '-DENABLE_LANGUAGE_DETECTION=1' '-DENABLE_PRINTING=1' '-DENABLE_CAPTIVE_PORTAL_DETECTION=1' '-DENABLE_MANAGED_USERS=1' '-DNO_HEAP_CHECK' '-DNDEBUG' '-DNVALGRIND' '-DDYNAMIC_ANNOTATIONS_ENABLED=0' -Ibase/allocator -Ithird_party/tcmalloc/chromium/src/base -Ithird_party/tcmalloc/chromium/src -I.  -fstack-protector --param=ssp-buffer-size=4 -pthread -fno-exceptions -fno-strict-aliasing -Wno-unused-parameter -Wno-missing-field-initializers -pipe -fPIC -Wno-sign-compare -Wno-unused-result -Wno-format -Wno-unused-result -O2 -fno-ident -fdata-sections -ffunction-sections -O2 -fPIC -fno-rtti -fno-threadsafe-statics -fvisibility-inlines-hidden -Wno-deprecated -MMD -MF out/Release/.deps/out/Release/obj.target/allocator/third_party/tcmalloc/chromium/src/base/spinlock.o.d.raw  -c -o out/Release/obj.target/allocator/third_party/tcmalloc/chromium/src/base/spinlock.o third_party/tcmalloc/chromium/src/base/spinlock.cc
  g++ '-D_FILE_OFFSET_BITS=64' '-DUSE_LINUX_BREAKPAD' '-DDISABLE_NACL' '-DCHROMIUM_BUILD' '-DUSE_DEFAULT_RENDER_THEME=1' '-DUSE_LIBJPEG_TURBO=1' '-DUSE_NSS=1' '-DENABLE_ONE_CLICK_SIGNIN' '-DGTK_DISABLE_SINGLE_INCLUDES=1' '-DENABLE_REMOTING=1' '-DENABLE_WEBRTC=1' '-DUSE_PROPRIETARY_CODECS' '-DENABLE_PEPPER_THREADING' '-DENABLE_CONFIGURATION_POLICY' '-DENABLE_INPUT_SPEECH' '-DENABLE_NOTIFICATIONS' '-DENABLE_GPU=1' '-DENABLE_EGLIMAGE=1' '-DUSE_SKIA=1' '-DENABLE_TASK_MANAGER=1' '-DENABLE_EXTENSIONS=1' '-DENABLE_PLUGIN_INSTALLATION=1' '-DENABLE_PLUGINS=1' '-DENABLE_SESSION_SERVICE=1' '-DENABLE_THEMES=1' '-DENABLE_BACKGROUND=1' '-DENABLE_AUTOMATION=1' '-DENABLE_GOOGLE_NOW=1' '-DENABLE_LANGUAGE_DETECTION=1' '-DENABLE_PRINTING=1' '-DENABLE_CAPTIVE_PORTAL_DETECTION=1' '-DENABLE_MANAGED_USERS=1' '-DNO_HEAP_CHECK' '-DNDEBUG' '-DNVALGRIND' '-DDYNAMIC_ANNOTATIONS_ENABLED=0' -Ibase/allocator -Ithird_party/tcmalloc/chromium/src/base -Ithird_party/tcmalloc/chromium/src -I.  -fstack-protector --param=ssp-buffer-size=4 -pthread -fno-exceptions -fno-strict-aliasing -Wno-unused-parameter -Wno-missing-field-initializers -pipe -fPIC -Wno-sign-compare -Wno-unused-result -Wno-format -Wno-unused-result -O2 -fno-ident -fdata-sections -ffunction-sections -O2 -fPIC -fno-rtti -fno-threadsafe-statics -fvisibility-inlines-hidden -Wno-deprecated -MMD -MF out/Release/.deps/out/Release/obj.target/allocator/third_party/tcmalloc/chromium/src/base/sysinfo.o.d.raw  -c -o out/Release/obj.target/allocator/third_party/tcmalloc/chromium/src/base/sysinfo.o third_party/tcmalloc/chromium/src/base/sysinfo.cc
  g++ '-D_FILE_OFFSET_BITS=64' '-DUSE_LINUX_BREAKPAD' '-DDISABLE_NACL' '-DCHROMIUM_BUILD' '-DUSE_DEFAULT_RENDER_THEME=1' '-DUSE_LIBJPEG_TURBO=1' '-DUSE_NSS=1' '-DENABLE_ONE_CLICK_SIGNIN' '-DGTK_DISABLE_SINGLE_INCLUDES=1' '-DENABLE_REMOTING=1' '-DENABLE_WEBRTC=1' '-DUSE_PROPRIETARY_CODECS' '-DENABLE_PEPPER_THREADING' '-DENABLE_CONFIGURATION_POLICY' '-DENABLE_INPUT_SPEECH' '-DENABLE_NOTIFICATIONS' '-DENABLE_GPU=1' '-DENABLE_EGLIMAGE=1' '-DUSE_SKIA=1' '-DENABLE_TASK_MANAGER=1' '-DENABLE_EXTENSIONS=1' '-DENABLE_PLUGIN_INSTALLATION=1' '-DENABLE_PLUGINS=1' '-DENABLE_SESSION_SERVICE=1' '-DENABLE_THEMES=1' '-DENABLE_BACKGROUND=1' '-DENABLE_AUTOMATION=1' '-DENABLE_GOOGLE_NOW=1' '-DENABLE_LANGUAGE_DETECTION=1' '-DENABLE_PRINTING=1' '-DENABLE_CAPTIVE_PORTAL_DETECTION=1' '-DENABLE_MANAGED_USERS=1' '-DNO_HEAP_CHECK' '-DNDEBUG' '-DNVALGRIND' '-DDYNAMIC_ANNOTATIONS_ENABLED=0' -Ibase/allocator -Ithird_party/tcmalloc/chromium/src/base -Ithird_party/tcmalloc/chromium/src -I.  -fstack-protector --param=ssp-buffer-size=4 -pthread -fno-exceptions -fno-strict-aliasing -Wno-unused-parameter -Wno-missing-field-initializers -pipe -fPIC -Wno-sign-compare -Wno-unused-result -Wno-format -Wno-unused-result -O2 -fno-ident -fdata-sections -ffunction-sections -O2 -fPIC -fno-rtti -fno-threadsafe-statics -fvisibility-inlines-hidden -Wno-deprecated -MMD -MF out/Release/.deps/out/Release/obj.target/allocator/third_party/tcmalloc/chromium/src/base/spinlock_internal.o.d.raw  -c -o out/Release/obj.target/allocator/third_party/tcmalloc/chromium/src/base/spinlock_internal.o third_party/tcmalloc/chromium/src/base/spinlock_internal.cc
third_party/tcmalloc/chromium/src/base/linuxthreads.cc: In function 'void ListerThread(ListerParams*)':
third_party/tcmalloc/chromium/src/base/linuxthreads.cc:312:22: error: invalid conversion from 'void (*)(int, siginfo_t*, void*)' to 'void (*)(int, siginfo*, void*)' [-fpermissive]
     sa.sa_sigaction_ = SignalHandler;
                      ^
make: *** [out/Release/obj.target/allocator/third_party/tcmalloc/chromium/src/base/linuxthreads.o] Error 1
make: *** Waiting for root@darkstar:/usr/src/chromium# rm /usr/bin/ld
root@darkstar:/usr/src/chromium# ln -s /usr/bin/ld.gold /usr/bin/ld
root@darkstar:/usr/src/chromium# ./chromium.Slackbuild 
chmod: cannot operate on dangling symlink './build/android/arm-linux-androideabi-gold/arm-linux-androideabi-ld'
chmod: cannot operate on dangling symlink './build/android/arm-linux-androideabi-gold/ld'
chmod: cannot operate on dangling symlink './third_party/openssl/openssl/test/fips_aesavs.c'
chmod: cannot operate on dangling symlink './third_party/openssl/openssl/test/fips_hmactest.c'
chmod: cannot operate on dangling symlink './third_party/openssl/openssl/test/fips_dssvs.c'
chmod: cannot operate on dangling symlink './third_party/openssl/openssl/test/fips_desmovs.c'
chmod: cannot operate on dangling symlink './third_party/openssl/openssl/test/fips_test_suite.c'
chmod: cannot operate on dangling symlink './third_party/openssl/openssl/test/fips_rsagtest.c'
chmod: cannot operate on dangling symlink './third_party/openssl/openssl/test/fips_randtest.c'
chmod: cannot operate on dangling symlink './third_party/openssl/openssl/test/fips_rsavtest.c'
chmod: cannot operate on dangling symlink './third_party/openssl/openssl/test/fips_shatest.c'
chmod: cannot operate on dangling symlink './third_party/openssl/openssl/test/fips_rngvs.c'
chmod: cannot operate on dangling symlink './third_party/openssl/openssl/test/fips_rsastest.c'
chmod: cannot operate on dangling symlink './third_party/openssl/openssl/test/fips_dsatest.c'
Updating projects from gyp files...
  g++ '-D_FILE_OFFSET_BITS=64' '-DUSE_LINUX_BREAKPAD' '-DDISABLE_NACL' '-DCHROMIUM_BUILD' '-DUSE_DEFAULT_RENDER_THEME=1' '-DUSE_LIBJPEG_TURBO=1' '-DUSE_NSS=1' '-DENABLE_ONE_CLICK_SIGNIN' '-DGTK_DISABLE_SINGLE_INCLUDES=1' '-DENABLE_REMOTING=1' '-DENABLE_WEBRTC=1' '-DUSE_PROPRIETARY_CODECS' '-DENABLE_PEPPER_THREADING' '-DENABLE_CONFIGURATION_POLICY' '-DENABLE_INPUT_SPEECH' '-DENABLE_NOTIFICATIONS' '-DENABLE_GPU=1' '-DENABLE_EGLIMAGE=1' '-DUSE_SKIA=1' '-DENABLE_TASK_MANAGER=1' '-DENABLE_EXTENSIONS=1' '-DENABLE_PLUGIN_INSTALLATION=1' '-DENABLE_PLUGINS=1' '-DENABLE_SESSION_SERVICE=1' '-DENABLE_THEMES=1' '-DENABLE_BACKGROUND=1' '-DENABLE_AUTOMATION=1' '-DENABLE_GOOGLE_NOW=1' '-DENABLE_LANGUAGE_DETECTION=1' '-DENABLE_PRINTING=1' '-DENABLE_CAPTIVE_PORTAL_DETECTION=1' '-DENABLE_MANAGED_USERS=1' '-DNO_HEAP_CHECK' '-DNDEBUG' '-DNVALGRIND' '-DDYNAMIC_ANNOTATIONS_ENABLED=0' -Ibase/allocator -Ithird_party/tcmalloc/chromium/src/base -Ithird_party/tcmalloc/chromium/src -I.  -fstack-protector --param=ssp-buffer-size=4 -pthread -fno-exceptions -fno-strict-aliasing -Wno-unused-parameter -Wno-missing-field-initializers -pipe -fPIC -Wno-sign-compare -Wno-unused-result -Wno-format -Wno-unused-result -O2 -fno-ident -fdata-sections -ffunction-sections -O2 -fPIC -fno-rtti -fno-threadsafe-statics -fvisibility-inlines-hidden -Wno-deprecated -MMD -MF out/Release/.deps/out/Release/obj.target/allocator/third_party/tcmalloc/chromium/src/base/abort.o.d.raw  -c -o out/Release/obj.target/allocator/third_party/tcmalloc/chromium/src/base/abort.o third_party/tcmalloc/chromium/src/base/abort.cc
  g++ '-D_FILE_OFFSET_BITS=64' '-DUSE_LINUX_BREAKPAD' '-DDISABLE_NACL' '-DCHROMIUM_BUILD' '-DUSE_DEFAULT_RENDER_THEME=1' '-DUSE_LIBJPEG_TURBO=1' '-DUSE_NSS=1' '-DENABLE_ONE_CLICK_SIGNIN' '-DGTK_DISABLE_SINGLE_INCLUDES=1' '-DENABLE_REMOTING=1' '-DENABLE_WEBRTC=1' '-DUSE_PROPRIETARY_CODECS' '-DENABLE_PEPPER_THREADING' '-DENABLE_CONFIGURATION_POLICY' '-DENABLE_INPUT_SPEECH' '-DENABLE_NOTIFICATIONS' '-DENABLE_GPU=1' '-DENABLE_EGLIMAGE=1' '-DUSE_SKIA=1' '-DENABLE_TASK_MANAGER=1' '-DENABLE_EXTENSIONS=1' '-DENABLE_PLUGIN_INSTALLATION=1' '-DENABLE_PLUGINS=1' '-DENABLE_SESSION_SERVICE=1' '-DENABLE_THEMES=1' '-DENABLE_BACKGROUND=1' '-DENABLE_AUTOMATION=1' '-DENABLE_GOOGLE_NOW=1' '-DENABLE_LANGUAGE_DETECTION=1' '-DENABLE_PRINTING=1' '-DENABLE_CAPTIVE_PORTAL_DETECTION=1' '-DENABLE_MANAGED_USERS=1' '-DNO_HEAP_CHECK' '-DNDEBUG' '-DNVALGRIND' '-DDYNAMIC_ANNOTATIONS_ENABLED=0' -Ibase/allocator -Ithird_party/tcmalloc/chromium/src/base -Ithird_party/tcmalloc/chromium/src -I.  -fstack-protector --param=ssp-buffer-size=4 -pthread -fno-exceptions -fno-strict-aliasing -Wno-unused-parameter -Wno-missing-field-initializers -pipe -fPIC -Wno-sign-compare -Wno-unused-result -Wno-format -Wno-unused-result -O2 -fno-ident -fdata-sections -ffunction-sections -O2 -fPIC -fno-rtti -fno-threadsafe-statics -fvisibility-inlines-hidden -Wno-deprecated -MMD -MF out/Release/.deps/out/Release/obj.target/allocator/third_party/tcmalloc/chromium/src/base/elf_mem_image.o.d.raw  -c -o out/Release/obj.target/allocator/third_party/tcmalloc/chromium/src/base/elf_mem_image.o third_party/tcmalloc/chromium/src/base/elf_mem_image.cc
  g++ '-D_FILE_OFFSET_BITS=64' '-DUSE_LINUX_BREAKPAD' '-DDISABLE_NACL' '-DCHROMIUM_BUILD' '-DUSE_DEFAULT_RENDER_THEME=1' '-DUSE_LIBJPEG_TURBO=1' '-DUSE_NSS=1' '-DENABLE_ONE_CLICK_SIGNIN' '-DGTK_DISABLE_SINGLE_INCLUDES=1' '-DENABLE_REMOTING=1' '-DENABLE_WEBRTC=1' '-DUSE_PROPRIETARY_CODECS' '-DENABLE_PEPPER_THREADING' '-DENABLE_CONFIGURATION_POLICY' '-DENABLE_INPUT_SPEECH' '-DENABLE_NOTIFICATIONS' '-DENABLE_GPU=1' '-DENABLE_EGLIMAGE=1' '-DUSE_SKIA=1' '-DENABLE_TASK_MANAGER=1' '-DENABLE_EXTENSIONS=1' '-DENABLE_PLUGIN_INSTALLATION=1' '-DENABLE_PLUGINS=1' '-DENABLE_SESSION_SERVICE=1' '-DENABLE_THEMES=1' '-DENABLE_BACKGROUND=1' '-DENABLE_AUTOMATION=1' '-DENABLE_GOOGLE_NOW=1' '-DENABLE_LANGUAGE_DETECTION=1' '-DENABLE_PRINTING=1' '-DENABLE_CAPTIVE_PORTAL_DETECTION=1' '-DENABLE_MANAGED_USERS=1' '-DNO_HEAP_CHECK' '-DNDEBUG' '-DNVALGRIND' '-DDYNAMIC_ANNOTATIONS_ENABLED=0' -Ibase/allocator -Ithird_party/tcmalloc/chromium/src/base -Ithird_party/tcmalloc/chromium/src -I.  -fstack-protector --param=ssp-buffer-size=4 -pthread -fno-exceptions -fno-strict-aliasing -Wno-unused-parameter -Wno-missing-field-initializers -pipe -fPIC -Wno-sign-compare -Wno-unused-result -Wno-format -Wno-unused-result -O2 -fno-ident -fdata-sections -ffunction-sections -O2 -fPIC -fno-rtti -fno-threadsafe-statics -fvisibility-inlines-hidden -Wno-deprecated -MMD -MF out/Release/.deps/out/Release/obj.target/allocator/third_party/tcmalloc/chromium/src/base/linuxthreads.o.d.raw  -c -o out/Release/obj.target/allocator/third_party/tcmalloc/chromium/src/base/linuxthreads.o third_party/tcmalloc/chromium/src/base/linuxthreads.cc
  g++ '-D_FILE_OFFSET_BITS=64' '-DUSE_LINUX_BREAKPAD' '-DDISABLE_NACL' '-DCHROMIUM_BUILD' '-DUSE_DEFAULT_RENDER_THEME=1' '-DUSE_LIBJPEG_TURBO=1' '-DUSE_NSS=1' '-DENABLE_ONE_CLICK_SIGNIN' '-DGTK_DISABLE_SINGLE_INCLUDES=1' '-DENABLE_REMOTING=1' '-DENABLE_WEBRTC=1' '-DUSE_PROPRIETARY_CODECS' '-DENABLE_PEPPER_THREADING' '-DENABLE_CONFIGURATION_POLICY' '-DENABLE_INPUT_SPEECH' '-DENABLE_NOTIFICATIONS' '-DENABLE_GPU=1' '-DENABLE_EGLIMAGE=1' '-DUSE_SKIA=1' '-DENABLE_TASK_MANAGER=1' '-DENABLE_EXTENSIONS=1' '-DENABLE_PLUGIN_INSTALLATION=1' '-DENABLE_PLUGINS=1' '-DENABLE_SESSION_SERVICE=1' '-DENABLE_THEMES=1' '-DENABLE_BACKGROUND=1' '-DENABLE_AUTOMATION=1' '-DENABLE_GOOGLE_NOW=1' '-DENABLE_LANGUAGE_DETECTION=1' '-DENABLE_PRINTING=1' '-DENABLE_CAPTIVE_PORTAL_DETECTION=1' '-DENABLE_MANAGED_USERS=1' '-DNO_HEAP_CHECK' '-DNDEBUG' '-DNVALGRIND' '-DDYNAMIC_ANNOTATIONS_ENABLED=0' -Ibase/allocator -Ithird_party/tcmalloc/chromium/src/base -Ithird_party/tcmalloc/chromium/src -I.  -fstack-protector --param=ssp-buffer-size=4 -pthread -fno-exceptions -fno-strict-aliasing -Wno-unused-parameter -Wno-missing-field-initializers -pipe -fPIC -Wno-sign-compare -Wno-unused-result -Wno-format -Wno-unused-result -O2 -fno-ident -fdata-sections -ffunction-sections -O2 -fPIC -fno-rtti -fno-threadsafe-statics -fvisibility-inlines-hidden -Wno-deprecated -MMD -MF out/Release/.deps/out/Release/obj.target/allocator/third_party/tcmalloc/chromium/src/base/logging.o.d.raw  -c -o out/Release/obj.target/allocator/third_party/tcmalloc/chromium/src/base/logging.o third_party/tcmalloc/chromium/src/base/logging.cc
  g++ '-D_FILE_OFFSET_BITS=64' '-DUSE_LINUX_BREAKPAD' '-DDISABLE_NACL' '-DCHROMIUM_BUILD' '-DUSE_DEFAULT_RENDER_THEME=1' '-DUSE_LIBJPEG_TURBO=1' '-DUSE_NSS=1' '-DENABLE_ONE_CLICK_SIGNIN' '-DGTK_DISABLE_SINGLE_INCLUDES=1' '-DENABLE_REMOTING=1' '-DENABLE_WEBRTC=1' '-DUSE_PROPRIETARY_CODECS' '-DENABLE_PEPPER_THREADING' '-DENABLE_CONFIGURATION_POLICY' '-DENABLE_INPUT_SPEECH' '-DENABLE_NOTIFICATIONS' '-DENABLE_GPU=1' '-DENABLE_EGLIMAGE=1' '-DUSE_SKIA=1' '-DENABLE_TASK_MANAGER=1' '-DENABLE_EXTENSIONS=1' '-DENABLE_PLUGIN_INSTALLATION=1' '-DENABLE_PLUGINS=1' '-DENABLE_SESSION_SERVICE=1' '-DENABLE_THEMES=1' '-DENABLE_BACKGROUND=1' '-DENABLE_AUTOMATION=1' '-DENABLE_GOOGLE_NOW=1' '-DENABLE_LANGUAGE_DETECTION=1' '-DENABLE_PRINTING=1' '-DENABLE_CAPTIVE_PORTAL_DETECTION=1' '-DENABLE_MANAGED_USERS=1' '-DNO_HEAP_CHECK' '-DNDEBUG' '-DNVALGRIND' '-DDYNAMIC_ANNOTATIONS_ENABLED=0' -Ibase/allocator -Ithird_party/tcmalloc/chromium/src/base -Ithird_party/tcmalloc/chromium/src -I.  -fstack-protector --param=ssp-buffer-size=4 -pthread -fno-exceptions -fno-strict-aliasing -Wno-unused-parameter -Wno-missing-field-initializers -pipe -fPIC -Wno-sign-compare -Wno-unused-result -Wno-format -Wno-unused-result -O2 -fno-ident -fdata-sections -ffunction-sections -O2 -fPIC -fno-rtti -fno-threadsafe-statics -fvisibility-inlines-hidden -Wno-deprecated -MMD -MF out/Release/.deps/out/Release/obj.target/allocator/third_party/tcmalloc/chromium/src/base/low_level_alloc.o.d.raw  -c -o out/Release/obj.target/allocator/third_party/tcmalloc/chromium/src/base/low_level_alloc.o third_party/tcmalloc/chromium/src/base/low_level_alloc.cc
  g++ '-D_FILE_OFFSET_BITS=64' '-DUSE_LINUX_BREAKPAD' '-DDISABLE_NACL' '-DCHROMIUM_BUILD' '-DUSE_DEFAULT_RENDER_THEME=1' '-DUSE_LIBJPEG_TURBO=1' '-DUSE_NSS=1' '-DENABLE_ONE_CLICK_SIGNIN' '-DGTK_DISABLE_SINGLE_INCLUDES=1' '-DENABLE_REMOTING=1' '-DENABLE_WEBRTC=1' '-DUSE_PROPRIETARY_CODECS' '-DENABLE_PEPPER_THREADING' '-DENABLE_CONFIGURATION_POLICY' '-DENABLE_INPUT_SPEECH' '-DENABLE_NOTIFICATIONS' '-DENABLE_GPU=1' '-DENABLE_EGLIMAGE=1' '-DUSE_SKIA=1' '-DENABLE_TASK_MANAGER=1' '-DENABLE_EXTENSIONS=1' '-DENABLE_PLUGIN_INSTALLATION=1' '-DENABLE_PLUGINS=1' '-DENABLE_SESSION_SERVICE=1' '-DENABLE_THEMES=1' '-DENABLE_BACKGROUND=1' '-DENABLE_AUTOMATION=1' '-DENABLE_GOOGLE_NOW=1' '-DENABLE_LANGUAGE_DETECTION=1' '-DENABLE_PRINTING=1' '-DENABLE_CAPTIVE_PORTAL_DETECTION=1' '-DENABLE_MANAGED_USERS=1' '-DNO_HEAP_CHECK' '-DNDEBUG' '-DNVALGRIND' '-DDYNAMIC_ANNOTATIONS_ENABLED=0' -Ibase/allocator -Ithird_party/tcmalloc/chromium/src/base -Ithird_party/tcmalloc/chromium/src -I.  -fstack-protector --param=ssp-buffer-size=4 -pthread -fno-exceptions -fno-strict-aliasing -Wno-unused-parameter -Wno-missing-field-initializers -pipe -fPIC -Wno-sign-compare -Wno-unused-result -Wno-format -Wno-unused-result -O2 -fno-ident -fdata-sections -ffunction-sections -O2 -fPIC -fno-rtti -fno-threadsafe-statics -fvisibility-inlines-hidden -Wno-deprecated -MMD -MF out/Release/.deps/out/Release/obj.target/allocator/third_party/tcmalloc/chromium/src/base/spinlock.o.d.raw  -c -o out/Release/obj.target/allocator/third_party/tcmalloc/chromium/src/base/spinlock.o third_party/tcmalloc/chromium/src/base/spinlock.cc
  g++ '-D_FILE_OFFSET_BITS=64' '-DUSE_LINUX_BREAKPAD' '-DDISABLE_NACL' '-DCHROMIUM_BUILD' '-DUSE_DEFAULT_RENDER_THEME=1' '-DUSE_LIBJPEG_TURBO=1' '-DUSE_NSS=1' '-DENABLE_ONE_CLICK_SIGNIN' '-DGTK_DISABLE_SINGLE_INCLUDES=1' '-DENABLE_REMOTING=1' '-DENABLE_WEBRTC=1' '-DUSE_PROPRIETARY_CODECS' '-DENABLE_PEPPER_THREADING' '-DENABLE_CONFIGURATION_POLICY' '-DENABLE_INPUT_SPEECH' '-DENABLE_NOTIFICATIONS' '-DENABLE_GPU=1' '-DENABLE_EGLIMAGE=1' '-DUSE_SKIA=1' '-DENABLE_TASK_MANAGER=1' '-DENABLE_EXTENSIONS=1' '-DENABLE_PLUGIN_INSTALLATION=1' '-DENABLE_PLUGINS=1' '-DENABLE_SESSION_SERVICE=1' '-DENABLE_THEMES=1' '-DENABLE_BACKGROUND=1' '-DENABLE_AUTOMATION=1' '-DENABLE_GOOGLE_NOW=1' '-DENABLE_LANGUAGE_DETECTION=1' '-DENABLE_PRINTING=1' '-DENABLE_CAPTIVE_PORTAL_DETECTION=1' '-DENABLE_MANAGED_USERS=1' '-DNO_HEAP_CHECK' '-DNDEBUG' '-DNVALGRIND' '-DDYNAMIC_ANNOTATIONS_ENABLED=0' -Ibase/allocator -Ithird_party/tcmalloc/chromium/src/base -Ithird_party/tcmalloc/chromium/src -I.  -fstack-protector --param=ssp-buffer-size=4 -pthread -fno-exceptions -fno-strict-aliasing -Wno-unused-parameter -Wno-missing-field-initializers -pipe -fPIC -Wno-sign-compare -Wno-unused-result -Wno-format -Wno-unused-result -O2 -fno-ident -fdata-sections -ffunction-sections -O2 -fPIC -fno-rtti -fno-threadsafe-statics -fvisibility-inlines-hidden -Wno-deprecated -MMD -MF out/Release/.deps/out/Release/obj.target/allocator/third_party/tcmalloc/chromium/src/base/spinlock_internal.o.d.raw  -c -o out/Release/obj.target/allocator/third_party/tcmalloc/chromium/src/base/spinlock_internal.o third_party/tcmalloc/chromium/src/base/spinlock_internal.cc
  g++ '-D_FILE_OFFSET_BITS=64' '-DUSE_LINUX_BREAKPAD' '-DDISABLE_NACL' '-DCHROMIUM_BUILD' '-DUSE_DEFAULT_RENDER_THEME=1' '-DUSE_LIBJPEG_TURBO=1' '-DUSE_NSS=1' '-DENABLE_ONE_CLICK_SIGNIN' '-DGTK_DISABLE_SINGLE_INCLUDES=1' '-DENABLE_REMOTING=1' '-DENABLE_WEBRTC=1' '-DUSE_PROPRIETARY_CODECS' '-DENABLE_PEPPER_THREADING' '-DENABLE_CONFIGURATION_POLICY' '-DENABLE_INPUT_SPEECH' '-DENABLE_NOTIFICATIONS' '-DENABLE_GPU=1' '-DENABLE_EGLIMAGE=1' '-DUSE_SKIA=1' '-DENABLE_TASK_MANAGER=1' '-DENABLE_EXTENSIONS=1' '-DENABLE_PLUGIN_INSTALLATION=1' '-DENABLE_PLUGINS=1' '-DENABLE_SESSION_SERVICE=1' '-DENABLE_THEMES=1' '-DENABLE_BACKGROUND=1' '-DENABLE_AUTOMATION=1' '-DENABLE_GOOGLE_NOW=1' '-DENABLE_LANGUAGE_DETECTION=1' '-DENABLE_PRINTING=1' '-DENABLE_CAPTIVE_PORTAL_DETECTION=1' '-DENABLE_MANAGED_USERS=1' '-DNO_HEAP_CHECK' '-DNDEBUG' '-DNVALGRIND' '-DDYNAMIC_ANNOTATIONS_ENABLED=0' -Ibase/allocator -Ithird_party/tcmalloc/chromium/src/base -Ithird_party/tcmalloc/chromium/src -I.  -fstack-protector --param=ssp-buffer-size=4 -pthread -fno-exceptions -fno-strict-aliasing -Wno-unused-parameter -Wno-missing-field-initializers -pipe -fPIC -Wno-sign-compare -Wno-unused-result -Wno-format -Wno-unused-result -O2 -fno-ident -fdata-sections -ffunction-sections -O2 -fPIC -fno-rtti -fno-threadsafe-statics -fvisibility-inlines-hidden -Wno-deprecated -MMD -MF out/Release/.deps/out/Release/obj.target/allocator/third_party/tcmalloc/chromium/src/base/sysinfo.o.d.raw  -c -o out/Release/obj.target/allocator/third_party/tcmalloc/chromium/src/base/sysinfo.o third_party/tcmalloc/chromium/src/base/sysinfo.cc
third_party/tcmalloc/chromium/src/base/linuxthreads.cc: In function 'void ListerThread(ListerParams*)':
third_party/tcmalloc/chromium/src/base/linuxthreads.cc:312:22: error: invalid conversion from 'void (*)(int, siginfo_t*, void*)' to 'void (*)(int, siginfo*, void*)' [-fpermissive]
     sa.sa_sigaction_ = SignalHandler;
                      ^
make: *** [out/Release/obj.target/allocator/third_party/tcmalloc/chromium/src/base/linuxthreads.o] Error 1
make: *** Waiting for unfinished jobs....
root@darkstar:/usr/src/chromium# 
unfinished jobs....

Last edited by frushiyama; 04-09-2013 at 10:02 PM.
 
Old 04-10-2013, 12:17 AM   #4
willysr
Senior Member
 
Registered: Jul 2004
Location: Jogja, Indonesia
Distribution: Slackware-Current
Posts: 2,568

Rep: Reputation: 426Reputation: 426Reputation: 426Reputation: 426Reputation: 426
I think it's because of the upgrade in gcc
 
Old 04-18-2013, 01:44 PM   #5
fogpipe
Member
 
Registered: Mar 2011
Distribution: Slackware 64 Current
Posts: 330

Rep: Reputation: 80
Im having problems with this too. Same error message, anyone know hw this might be fixed?


Quote:
make: *** [out/Release/obj.target/allocator/third_party/tcmalloc/chromium/src/base/linuxthreads.o] Error 1
make: *** Waiting for unfinished jobs....
 
  


Reply

Tags
chromium


Thread Tools Search this Thread
Search this Thread:

Advanced Search

Posting Rules
You may not post new threads
You may not post replies
You may not post attachments
You may not edit your posts

BB code is On
Smilies are On
[IMG] code is Off
HTML code is Off



All times are GMT -5. The time now is 12:59 PM.

Main Menu
My LQ
Write for LQ
LinuxQuestions.org is looking for people interested in writing Editorials, Articles, Reviews, and more. If you'd like to contribute content, let us know.
Main Menu
Syndicate
RSS1  Latest Threads
RSS1  LQ News
Twitter: @linuxquestions
identi.ca: @linuxquestions
Facebook: linuxquestions Google+: linuxquestions
Open Source Consulting | Domain Registration