LinuxQuestions.org
Did you know LQ has a Linux Hardware Compatibility List?
Go Back   LinuxQuestions.org > Forums > Linux Forums > Linux - Distributions > Slackware
User Name
Password
Slackware This Forum is for the discussion of Slackware Linux.

Notices



Reply
 
Search this Thread
Old 12-08-2010, 11:21 AM   #1
trademark91
Member
 
Registered: Sep 2009
Distribution: Slackware -current x64
Posts: 372

Rep: Reputation: 73
slackware current refuses to inkscape slackbuild??


ok this has been bothering me. i clean installed 13.1 x64, then upgraded to -current with no issues. everything seems to compile and run fine, except for inkscape. i downloaded the slackbuilds of inkscape and all its dependencies, and all their dependencies, and installed them in the proper order, however, when i run the inkscape.Slackbuild, it takes like 30minutes and then exits with the following messages:

Code:
...
/usr/lib64/gcc/x86_64-slackware-linux/4.5.1/../../../../lib64/libxslt.so: undefined reference to `xmlXPathNodeSetAdd@LIBXML2_2.4.30'
/usr/lib64/gcc/x86_64-slackware-linux/4.5.1/../../../../lib64/libxslt.so: undefined reference to `xmlIsID@LIBXML2_2.4.30'
/usr/lib64/gcc/x86_64-slackware-linux/4.5.1/../../../../lib64/libxslt.so: undefined reference to `xmlDictCreateSub@LIBXML2_2.6.5'
/usr/lib64/gcc/x86_64-slackware-linux/4.5.1/../../../../lib64/libxslt.so: undefined reference to `xmlFreeMutex@LIBXML2_2.4.30'
/usr/lib64/gcc/x86_64-slackware-linux/4.5.1/../../../../lib64/libxslt.so: undefined reference to `xmlStrncat@LIBXML2_2.4.30'
/usr/lib64/gcc/x86_64-slackware-linux/4.5.1/../../../../lib64/libxslt.so: undefined reference to `xmlAllocOutputBuffer@LIBXML2_2.4.30'
/usr/lib64/gcc/x86_64-slackware-linux/4.5.1/../../../../lib64/libxslt.so: undefined reference to `xmlDocGetRootElement@LIBXML2_2.4.30'
/usr/lib64/gcc/x86_64-slackware-linux/4.5.1/../../../../lib64/libxslt.so: undefined reference to `xmlHashScanFull@LIBXML2_2.4.30'
/usr/lib64/gcc/x86_64-slackware-linux/4.5.1/../../../../lib64/libxslt.so: undefined reference to `xmlAddID@LIBXML2_2.4.30'
/usr/lib64/gcc/x86_64-slackware-linux/4.5.1/../../../../lib64/libxslt.so: undefined reference to `xmlFreeDoc@LIBXML2_2.4.30'
/usr/lib64/gcc/x86_64-slackware-linux/4.5.1/../../../../lib64/libxslt.so: undefined reference to `xmlFreeIDTable@LIBXML2_2.4.30'
/usr/lib64/gcc/x86_64-slackware-linux/4.5.1/../../../../lib64/libxslt.so: undefined reference to `xmlXPathEvalPredicate@LIBXML2_2.4.30'
/usr/lib64/gcc/x86_64-slackware-linux/4.5.1/../../../../lib64/libxslt.so: undefined reference to `xmlXPathStringEvalNumber@LIBXML2_2.4.30'
/usr/lib64/gcc/x86_64-slackware-linux/4.5.1/../../../../lib64/libpoppler.so: undefined reference to `xmlHasProp@LIBXML2_2.4.30'
/usr/lib64/gcc/x86_64-slackware-linux/4.5.1/../../../../lib64/libxslt.so: undefined reference to `xmlOutputBufferClose@LIBXML2_2.4.30'
/usr/lib64/gcc/x86_64-slackware-linux/4.5.1/../../../../lib64/libMagickCore.so: undefined reference to `xmlInitParser@LIBXML2_2.4.30'
/usr/lib64/gcc/x86_64-slackware-linux/4.5.1/../../../../lib64/libxslt.so: undefined reference to `xmlSetNsProp@LIBXML2_2.4.30'
/usr/lib64/gcc/x86_64-slackware-linux/4.5.1/../../../../lib64/libxslt.so: undefined reference to `xmlFreeParserCtxt@LIBXML2_2.4.30'
/usr/lib64/gcc/x86_64-slackware-linux/4.5.1/../../../../lib64/libxslt.so: undefined reference to `xmlNewNs@LIBXML2_2.4.30'
/usr/lib64/gcc/x86_64-slackware-linux/4.5.1/../../../../lib64/libxslt.so: undefined reference to `xmlIsBaseCharGroup@LIBXML2_2.6.0'
/usr/lib64/gcc/x86_64-slackware-linux/4.5.1/../../../../lib64/libxslt.so: undefined reference to `xmlNewDoc@LIBXML2_2.4.30'
/usr/lib64/gcc/x86_64-slackware-linux/4.5.1/../../../../lib64/libxslt.so: undefined reference to `xmlHashUpdateEntry3@LIBXML2_2.4.30'
/usr/lib64/gcc/x86_64-slackware-linux/4.5.1/../../../../lib64/libpoppler.so: undefined reference to `xmlNewNode@LIBXML2_2.4.30'
/usr/lib64/gcc/x86_64-slackware-linux/4.5.1/../../../../lib64/libxslt.so: undefined reference to `xmlBufferWriteQuotedString@LIBXML2_2.4.30'
/usr/lib64/gcc/x86_64-slackware-linux/4.5.1/../../../../lib64/libMagickCore.so: undefined reference to `xmlTextConcat@LIBXML2_2.4.30'
/usr/lib64/../lib64/librsvg-2.so.2: undefined reference to `xmlBuildRelativeURI@LIBXML2_2.6.11'
/usr/lib64/gcc/x86_64-slackware-linux/4.5.1/../../../../lib64/libxslt.so: undefined reference to `xmlNewDocProp@LIBXML2_2.4.30'
/usr/lib64/gcc/x86_64-slackware-linux/4.5.1/../../../../lib64/libxslt.so: undefined reference to `xmlIsBlankNode@LIBXML2_2.4.30'
/usr/lib64/gcc/x86_64-slackware-linux/4.5.1/../../../../lib64/libxslt.so: undefined reference to `xmlHashRemoveEntry2@LIBXML2_2.4.30'
/usr/lib64/gcc/x86_64-slackware-linux/4.5.1/../../../../lib64/libxslt.so: undefined reference to `xmlXPathNextAncestor@LIBXML2_2.4.30'
/usr/lib64/gcc/x86_64-slackware-linux/4.5.1/../../../../lib64/libxslt.so: undefined reference to `xmlNewDocPI@LIBXML2_2.6.15'
/usr/lib64/gcc/x86_64-slackware-linux/4.5.1/../../../../lib64/libxslt.so: undefined reference to `xmlXPathNewBoolean@LIBXML2_2.4.30'
/usr/lib64/gcc/x86_64-slackware-linux/4.5.1/../../../../lib64/libMagickCore.so: undefined reference to `xmlNanoHTTPRead@LIBXML2_2.4.30'
/usr/lib64/gcc/x86_64-slackware-linux/4.5.1/../../../../lib64/libxslt.so: undefined reference to `xmlStringTextNoenc@LIBXML2_2.4.30'
/usr/lib64/gcc/x86_64-slackware-linux/4.5.1/../../../../lib64/libxslt.so: undefined reference to `xmlNodeSetContent@LIBXML2_2.4.30'
/usr/lib64/gcc/x86_64-slackware-linux/4.5.1/../../../../lib64/libxslt.so: undefined reference to `inputPush@LIBXML2_2.4.30'
/usr/lib64/gcc/x86_64-slackware-linux/4.5.1/../../../../lib64/libxslt.so: undefined reference to `xmlStringCurrentChar@LIBXML2_2.4.30'
/usr/lib64/gcc/x86_64-slackware-linux/4.5.1/../../../../lib64/libxslt.so: undefined reference to `xmlCtxtUseOptions@LIBXML2_2.6.0'
/usr/lib64/gcc/x86_64-slackware-linux/4.5.1/../../../../lib64/libxslt.so: undefined reference to `xmlHashLookup3@LIBXML2_2.4.30'
collect2: ld returned 1 exit status
make[2]: *** [inkscape] Error 1
make[2]: Leaving directory `/tmp/SBo/inkscape-0.48.0/src'
make[1]: *** [all-recursive] Error 1
make[1]: Leaving directory `/tmp/SBo/inkscape-0.48.0'
make: *** [all] Error 2
it looks like an error with one of my gcc libraries, but i dont know how to go about fixing it. from what i see, 4.5.1 is the latest version, so i shouldnt be outdated, what is going on?
 
Old 12-08-2010, 11:35 AM   #2
trademark91
Member
 
Registered: Sep 2009
Distribution: Slackware -current x64
Posts: 372

Original Poster
Rep: Reputation: 73
so it wasnt a problem with gcc, it was an issue with libxml2...

Code:
slackpkg upgrade-all
did the trick.
 
  


Reply


Thread Tools Search this Thread
Search this Thread:

Advanced Search

Posting Rules
You may not post new threads
You may not post replies
You may not post attachments
You may not edit your posts

BB code is On
Smilies are On
[IMG] code is Off
HTML code is Off


Similar Threads
Thread Thread Starter Forum Replies Last Post
inkscape fails on current... imitis Slackware 6 04-07-2010 11:08 AM
lmms slackbuild fails with -current the_penguinator Slackware 3 02-03-2010 10:24 AM
[SOLVED] LMMS Slackbuild Error with Slackware Current (GCC 4.4.3) smoooth103 Slackware 4 01-30-2010 10:06 PM
fluxbox.SlackBuild in -current typo? wadsworth Slackware 9 11-13-2008 02:59 PM
GSB.SlackBuild ran on Slack-Current acummings Slackware 7 08-04-2006 09:30 AM


All times are GMT -5. The time now is 02:22 PM.

Main Menu
Advertisement
My LQ
Write for LQ
LinuxQuestions.org is looking for people interested in writing Editorials, Articles, Reviews, and more. If you'd like to contribute content, let us know.
Main Menu
Syndicate
RSS1  Latest Threads
RSS1  LQ News
Twitter: @linuxquestions
identi.ca: @linuxquestions
Facebook: linuxquestions Google+: linuxquestions
Open Source Consulting | Domain Registration