LinuxQuestions.org
Visit the LQ Articles and Editorials section
Go Back   LinuxQuestions.org > Forums > Linux Forums > Linux - Distributions > Slackware
User Name
Password
Slackware This Forum is for the discussion of Slackware Linux.

Notices

Reply
 
LinkBack Search this Thread
Old 04-08-2013, 09:24 AM   #1
anti_user
Member
 
Registered: May 2008
Location: Russia, Ural
Distribution: Slackware Current
Posts: 69

Rep: Reputation: 4
Exclamation Network manager pptp plugin doesnt compile at slackware-current


New bug found, nm pptp plugin doesnt compile anymore on slackware-current, i think its could be gcc new version errors
Code:
nm-pptp-service.c: In function 'nm_pptp_ppp_service_get_type':
/usr/include/glib-2.0/glib/gmacros.h:162:53: error: typedef '_GStaticAssertCompileTimeAssertion_0' locally defined but not used [-Werror=unused-local-typedefs]
 #define G_STATIC_ASSERT(expr) typedef char G_PASTE (_GStaticAssertCompileTimeAssertion_, __COUNTER__)[(expr) ? 1 : -1]
                                                     ^
/usr/include/glib-2.0/glib/gmacros.h:159:47: note: in definition of macro 'G_PASTE_ARGS'
 #define G_PASTE_ARGS(identifier1,identifier2) identifier1 ## identifier2
                                               ^
/usr/include/glib-2.0/glib/gmacros.h:162:44: note: in expansion of macro 'G_PASTE'
 #define G_STATIC_ASSERT(expr) typedef char G_PASTE (_GStaticAssertCompileTimeAssertion_, __COUNTER__)[(expr) ? 1 : -1]
                                            ^
/usr/include/glib-2.0/glib/gthread.h:234:5: note: in expansion of macro 'G_STATIC_ASSERT'
     G_STATIC_ASSERT (sizeof *(location) == sizeof (gpointer));       \
     ^
/usr/include/glib-2.0/gobject/gtype.h:1463:7: note: in expansion of macro 'g_once_init_enter'
   if (g_once_init_enter (&g_define_type_id__volatile))  \
       ^
/usr/include/glib-2.0/gobject/gtype.h:1387:60: note: in expansion of macro '_G_DEFINE_TYPE_EXTENDED_BEGIN'
 #define G_DEFINE_TYPE_EXTENDED(TN, t_n, T_P, _f_, _C_)     _G_DEFINE_TYPE_EXTENDED_BEGIN (TN, t_n, T_P, _f_) {_C_;} _G_DEFINE_TYPE_EXTENDED_END()
                                                            ^
/usr/include/glib-2.0/gobject/gtype.h:1279:43: note: in expansion of macro 'G_DEFINE_TYPE_EXTENDED'
 #define G_DEFINE_TYPE(TN, t_n, T_P)       G_DEFINE_TYPE_EXTENDED (TN, t_n, T_P, 0, {})
                                           ^
nm-pptp-service.c:91:1: note: in expansion of macro 'G_DEFINE_TYPE'
 G_DEFINE_TYPE (NMPptpPppService, nm_pptp_ppp_service, G_TYPE_OBJECT)
 ^
/usr/include/glib-2.0/glib/gmacros.h:162:53: error: typedef '_GStaticAssertCompileTimeAssertion_1' locally defined but not used [-Werror=unused-local-typedefs]
 #define G_STATIC_ASSERT(expr) typedef char G_PASTE (_GStaticAssertCompileTimeAssertion_, __COUNTER__)[(expr) ? 1 : -1]
                                                     ^
/usr/include/glib-2.0/glib/gmacros.h:159:47: note: in definition of macro 'G_PASTE_ARGS'
 #define G_PASTE_ARGS(identifier1,identifier2) identifier1 ## identifier2
                                               ^
/usr/include/glib-2.0/glib/gmacros.h:162:44: note: in expansion of macro 'G_PASTE'
 #define G_STATIC_ASSERT(expr) typedef char G_PASTE (_GStaticAssertCompileTimeAssertion_, __COUNTER__)[(expr) ? 1 : -1]
                                            ^
/usr/include/glib-2.0/glib/gatomic.h:136:5: note: in expansion of macro 'G_STATIC_ASSERT'
     G_STATIC_ASSERT (sizeof *(atomic) == sizeof (gpointer));                 \
     ^
/usr/include/glib-2.0/glib/gthread.h:236:7: note: in expansion of macro 'g_atomic_pointer_get'
     (!g_atomic_pointer_get (location) &&                             \
       ^
/usr/include/glib-2.0/gobject/gtype.h:1463:7: note: in expansion of macro 'g_once_init_enter'
   if (g_once_init_enter (&g_define_type_id__volatile))  \
       ^
/usr/include/glib-2.0/gobject/gtype.h:1387:60: note: in expansion of macro '_G_DEFINE_TYPE_EXTENDED_BEGIN'
 #define G_DEFINE_TYPE_EXTENDED(TN, t_n, T_P, _f_, _C_)     _G_DEFINE_TYPE_EXTENDED_BEGIN (TN, t_n, T_P, _f_) {_C_;} _G_DEFINE_TYPE_EXTENDED_END()
                                                            ^
/usr/include/glib-2.0/gobject/gtype.h:1279:43: note: in expansion of macro 'G_DEFINE_TYPE_EXTENDED'
 #define G_DEFINE_TYPE(TN, t_n, T_P)       G_DEFINE_TYPE_EXTENDED (TN, t_n, T_P, 0, {})
                                           ^
nm-pptp-service.c:91:1: note: in expansion of macro 'G_DEFINE_TYPE'
 G_DEFINE_TYPE (NMPptpPppService, nm_pptp_ppp_service, G_TYPE_OBJECT)
 ^
/usr/include/glib-2.0/glib/gmacros.h:162:53: error: typedef '_GStaticAssertCompileTimeAssertion_2' locally defined but not used [-Werror=unused-local-typedefs]
 #define G_STATIC_ASSERT(expr) typedef char G_PASTE (_GStaticAssertCompileTimeAssertion_, __COUNTER__)[(expr) ? 1 : -1]
                                                     ^
/usr/include/glib-2.0/glib/gmacros.h:159:47: note: in definition of macro 'G_PASTE_ARGS'
 #define G_PASTE_ARGS(identifier1,identifier2) identifier1 ## identifier2
                                               ^
/usr/include/glib-2.0/glib/gmacros.h:162:44: note: in expansion of macro 'G_PASTE'
 #define G_STATIC_ASSERT(expr) typedef char G_PASTE (_GStaticAssertCompileTimeAssertion_, __COUNTER__)[(expr) ? 1 : -1]
                                            ^
/usr/include/glib-2.0/glib/gthread.h:241:5: note: in expansion of macro 'G_STATIC_ASSERT'
     G_STATIC_ASSERT (sizeof *(location) == sizeof (gpointer));       \
     ^
/usr/include/glib-2.0/gobject/gtype.h:1477:7: note: in expansion of macro 'g_once_init_leave'
       g_once_init_leave (&g_define_type_id__volatile, g_define_type_id); \
       ^
/usr/include/glib-2.0/gobject/gtype.h:1387:117: note: in expansion of macro '_G_DEFINE_TYPE_EXTENDED_END'
 #define G_DEFINE_TYPE_EXTENDED(TN, t_n, T_P, _f_, _C_)     _G_DEFINE_TYPE_EXTENDED_BEGIN (TN, t_n, T_P, _f_) {_C_;} _G_DEFINE_TYPE_EXTENDED_END()
                                                                                                                     ^
/usr/include/glib-2.0/gobject/gtype.h:1279:43: note: in expansion of macro 'G_DEFINE_TYPE_EXTENDED'
 #define G_DEFINE_TYPE(TN, t_n, T_P)       G_DEFINE_TYPE_EXTENDED (TN, t_n, T_P, 0, {})
                                           ^
nm-pptp-service.c:91:1: note: in expansion of macro 'G_DEFINE_TYPE'
 G_DEFINE_TYPE (NMPptpPppService, nm_pptp_ppp_service, G_TYPE_OBJECT)
 ^
nm-pptp-service.c: In function 'nm_pptp_plugin_get_type':
/usr/include/glib-2.0/glib/gmacros.h:162:53: error: typedef '_GStaticAssertCompileTimeAssertion_3' locally defined but not used [-Werror=unused-local-typedefs]
 #define G_STATIC_ASSERT(expr) typedef char G_PASTE (_GStaticAssertCompileTimeAssertion_, __COUNTER__)[(expr) ? 1 : -1]
                                                     ^
/usr/include/glib-2.0/glib/gmacros.h:159:47: note: in definition of macro 'G_PASTE_ARGS'
 #define G_PASTE_ARGS(identifier1,identifier2) identifier1 ## identifier2
                                               ^
/usr/include/glib-2.0/glib/gmacros.h:162:44: note: in expansion of macro 'G_PASTE'
 #define G_STATIC_ASSERT(expr) typedef char G_PASTE (_GStaticAssertCompileTimeAssertion_, __COUNTER__)[(expr) ? 1 : -1]
                                            ^
/usr/include/glib-2.0/glib/gthread.h:234:5: note: in expansion of macro 'G_STATIC_ASSERT'
     G_STATIC_ASSERT (sizeof *(location) == sizeof (gpointer));       \
     ^
/usr/include/glib-2.0/gobject/gtype.h:1463:7: note: in expansion of macro 'g_once_init_enter'
   if (g_once_init_enter (&g_define_type_id__volatile))  \
       ^
/usr/include/glib-2.0/gobject/gtype.h:1387:60: note: in expansion of macro '_G_DEFINE_TYPE_EXTENDED_BEGIN'
 #define G_DEFINE_TYPE_EXTENDED(TN, t_n, T_P, _f_, _C_)     _G_DEFINE_TYPE_EXTENDED_BEGIN (TN, t_n, T_P, _f_) {_C_;} _G_DEFINE_TYPE_EXTENDED_END()
                                                            ^
/usr/include/glib-2.0/gobject/gtype.h:1279:43: note: in expansion of macro 'G_DEFINE_TYPE_EXTENDED'
 #define G_DEFINE_TYPE(TN, t_n, T_P)       G_DEFINE_TYPE_EXTENDED (TN, t_n, T_P, 0, {})
                                           ^
nm-pptp-service.c:474:1: note: in expansion of macro 'G_DEFINE_TYPE'
 G_DEFINE_TYPE (NMPptpPlugin, nm_pptp_plugin, NM_TYPE_VPN_PLUGIN)
 ^
/usr/include/glib-2.0/glib/gmacros.h:162:53: error: typedef '_GStaticAssertCompileTimeAssertion_4' locally defined but not used [-Werror=unused-local-typedefs]
 #define G_STATIC_ASSERT(expr) typedef char G_PASTE (_GStaticAssertCompileTimeAssertion_, __COUNTER__)[(expr) ? 1 : -1]
                                                     ^
/usr/include/glib-2.0/glib/gmacros.h:159:47: note: in definition of macro 'G_PASTE_ARGS'
 #define G_PASTE_ARGS(identifier1,identifier2) identifier1 ## identifier2
                                               ^
/usr/include/glib-2.0/glib/gmacros.h:162:44: note: in expansion of macro 'G_PASTE'
 #define G_STATIC_ASSERT(expr) typedef char G_PASTE (_GStaticAssertCompileTimeAssertion_, __COUNTER__)[(expr) ? 1 : -1]
                                            ^
/usr/include/glib-2.0/glib/gatomic.h:136:5: note: in expansion of macro 'G_STATIC_ASSERT'
     G_STATIC_ASSERT (sizeof *(atomic) == sizeof (gpointer));                 \
     ^
/usr/include/glib-2.0/glib/gthread.h:236:7: note: in expansion of macro 'g_atomic_pointer_get'
     (!g_atomic_pointer_get (location) &&                             \
       ^
/usr/include/glib-2.0/gobject/gtype.h:1463:7: note: in expansion of macro 'g_once_init_enter'
   if (g_once_init_enter (&g_define_type_id__volatile))  \
       ^
/usr/include/glib-2.0/gobject/gtype.h:1387:60: note: in expansion of macro '_G_DEFINE_TYPE_EXTENDED_BEGIN'
 #define G_DEFINE_TYPE_EXTENDED(TN, t_n, T_P, _f_, _C_)     _G_DEFINE_TYPE_EXTENDED_BEGIN (TN, t_n, T_P, _f_) {_C_;} _G_DEFINE_TYPE_EXTENDED_END()
                                                            ^
/usr/include/glib-2.0/gobject/gtype.h:1279:43: note: in expansion of macro 'G_DEFINE_TYPE_EXTENDED'
 #define G_DEFINE_TYPE(TN, t_n, T_P)       G_DEFINE_TYPE_EXTENDED (TN, t_n, T_P, 0, {})
                                           ^
nm-pptp-service.c:474:1: note: in expansion of macro 'G_DEFINE_TYPE'
 G_DEFINE_TYPE (NMPptpPlugin, nm_pptp_plugin, NM_TYPE_VPN_PLUGIN)
 ^
/usr/include/glib-2.0/glib/gmacros.h:162:53: error: typedef '_GStaticAssertCompileTimeAssertion_5' locally defined but not used [-Werror=unused-local-typedefs]
 #define G_STATIC_ASSERT(expr) typedef char G_PASTE (_GStaticAssertCompileTimeAssertion_, __COUNTER__)[(expr) ? 1 : -1]
                                                     ^
/usr/include/glib-2.0/glib/gmacros.h:159:47: note: in definition of macro 'G_PASTE_ARGS'
 #define G_PASTE_ARGS(identifier1,identifier2) identifier1 ## identifier2
                                               ^
/usr/include/glib-2.0/glib/gmacros.h:162:44: note: in expansion of macro 'G_PASTE'
 #define G_STATIC_ASSERT(expr) typedef char G_PASTE (_GStaticAssertCompileTimeAssertion_, __COUNTER__)[(expr) ? 1 : -1]
                                            ^
/usr/include/glib-2.0/glib/gthread.h:241:5: note: in expansion of macro 'G_STATIC_ASSERT'
     G_STATIC_ASSERT (sizeof *(location) == sizeof (gpointer));       \
     ^
/usr/include/glib-2.0/gobject/gtype.h:1477:7: note: in expansion of macro 'g_once_init_leave'
       g_once_init_leave (&g_define_type_id__volatile, g_define_type_id); \
       ^
/usr/include/glib-2.0/gobject/gtype.h:1387:117: note: in expansion of macro '_G_DEFINE_TYPE_EXTENDED_END'
 #define G_DEFINE_TYPE_EXTENDED(TN, t_n, T_P, _f_, _C_)     _G_DEFINE_TYPE_EXTENDED_BEGIN (TN, t_n, T_P, _f_) {_C_;} _G_DEFINE_TYPE_EXTENDED_END()
                                                                                                                     ^
/usr/include/glib-2.0/gobject/gtype.h:1279:43: note: in expansion of macro 'G_DEFINE_TYPE_EXTENDED'
 #define G_DEFINE_TYPE(TN, t_n, T_P)       G_DEFINE_TYPE_EXTENDED (TN, t_n, T_P, 0, {})
                                           ^
nm-pptp-service.c:474:1: note: in expansion of macro 'G_DEFINE_TYPE'
 G_DEFINE_TYPE (NMPptpPlugin, nm_pptp_plugin, NM_TYPE_VPN_PLUGIN)
 ^
cc1: all warnings being treated as errors
make[3]: *** [nm-pptp-service.o] Error 1
make[3]: Leaving directory `/tmp/SBo/NetworkManager-pptp-0.9.4.0/src'
make[2]: *** [all] Error 2
make[2]: Leaving directory `/tmp/SBo/NetworkManager-pptp-0.9.4.0/src'
make[1]: *** [all-recursive] Error 1
make[1]: Leaving directory `/tmp/SBo/NetworkManager-pptp-0.9.4.0'
make: *** [all] Error 2
I trying to build from http://slackbuilds.org/repository/14...kManager-pptp/
 
Old 04-08-2013, 10:10 AM   #2
willysr
Senior Member
 
Registered: Jul 2004
Location: Jogja, Indonesia
Distribution: Slackware-Current
Posts: 2,355

Rep: Reputation: 378Reputation: 378Reputation: 378Reputation: 378
Please note that slackbuilds only support stable releases and those bugs will be fixed when new slackware has been released
 
Old 04-08-2013, 10:15 AM   #3
allend
Senior Member
 
Registered: Oct 2003
Location: Melbourne
Distribution: Slackware-current
Posts: 3,293

Rep: Reputation: 803Reputation: 803Reputation: 803Reputation: 803Reputation: 803Reputation: 803Reputation: 803
Quote:
cc1: all warnings being treated as errors
I have not tried this, but it looks very similar to the problem in this thread. http://www.linuxquestions.org/questi...nt-4175457003/
volkerdi had some advice there.
 
Old 04-08-2013, 11:27 AM   #4
anti_user
Member
 
Registered: May 2008
Location: Russia, Ural
Distribution: Slackware Current
Posts: 69

Original Poster
Rep: Reputation: 4
Quote:
Originally Posted by allend View Post
I have not tried this, but it looks very similar to the problem in this thread. http://www.linuxquestions.org/questi...nt-4175457003/
volkerdi had some advice there.
much thanks! its helped me
 
  


Reply


Thread Tools Search this Thread
Search this Thread:

Advanced Search

Posting Rules
You may not post new threads
You may not post replies
You may not post attachments
You may not edit your posts

BB code is On
Smilies are On
[IMG] code is Off
HTML code is Off
Trackbacks are Off
Pingbacks are On
Refbacks are Off


Similar Threads
Thread Thread Starter Forum Replies Last Post
[SOLVED] mod_wsgi mod_python doesnt compiling in slackware-current anti_user Slackware 2 09-10-2012 06:59 AM
Wireless network connects and works fine, but doesnt show up on the network manager newbie236 Linux - Newbie 1 07-07-2010 12:47 AM
Network Manager pptp vpn working only with roaming mode hulf Linux - Software 0 04-29-2008 12:21 PM
network-manager-pptp Rock'n'Metal Linux - Newbie 1 03-13-2008 08:35 PM
Slackware network-manager-pptp package Cyhaxor Slackware 6 09-28-2007 10:50 PM


All times are GMT -5. The time now is 07:29 PM.

Main Menu
My LQ
Write for LQ
LinuxQuestions.org is looking for people interested in writing Editorials, Articles, Reviews, and more. If you'd like to contribute content, let us know.
Main Menu
Syndicate
RSS1  Latest Threads
RSS1  LQ News
Twitter: @linuxquestions
identi.ca: @linuxquestions
Facebook: linuxquestions Google+: linuxquestions
Open Source Consulting | Domain Registration