LinuxQuestions.org

LinuxQuestions.org (/questions/)
-   Slackware (http://www.linuxquestions.org/questions/slackware-14/)
-   -   Network manager pptp plugin doesnt compile at slackware-current (http://www.linuxquestions.org/questions/slackware-14/network-manager-pptp-plugin-doesnt-compile-at-slackware-current-4175457352/)

anti_user 04-08-2013 10:24 AM

Network manager pptp plugin doesnt compile at slackware-current
 
New bug found, nm pptp plugin doesnt compile anymore on slackware-current, i think its could be gcc new version errors
Code:

nm-pptp-service.c: In function 'nm_pptp_ppp_service_get_type':
/usr/include/glib-2.0/glib/gmacros.h:162:53: error: typedef '_GStaticAssertCompileTimeAssertion_0' locally defined but not used [-Werror=unused-local-typedefs]
 #define G_STATIC_ASSERT(expr) typedef char G_PASTE (_GStaticAssertCompileTimeAssertion_, __COUNTER__)[(expr) ? 1 : -1]
                                                    ^
/usr/include/glib-2.0/glib/gmacros.h:159:47: note: in definition of macro 'G_PASTE_ARGS'
 #define G_PASTE_ARGS(identifier1,identifier2) identifier1 ## identifier2
                                              ^
/usr/include/glib-2.0/glib/gmacros.h:162:44: note: in expansion of macro 'G_PASTE'
 #define G_STATIC_ASSERT(expr) typedef char G_PASTE (_GStaticAssertCompileTimeAssertion_, __COUNTER__)[(expr) ? 1 : -1]
                                            ^
/usr/include/glib-2.0/glib/gthread.h:234:5: note: in expansion of macro 'G_STATIC_ASSERT'
    G_STATIC_ASSERT (sizeof *(location) == sizeof (gpointer));      \
    ^
/usr/include/glib-2.0/gobject/gtype.h:1463:7: note: in expansion of macro 'g_once_init_enter'
  if (g_once_init_enter (&g_define_type_id__volatile))  \
      ^
/usr/include/glib-2.0/gobject/gtype.h:1387:60: note: in expansion of macro '_G_DEFINE_TYPE_EXTENDED_BEGIN'
 #define G_DEFINE_TYPE_EXTENDED(TN, t_n, T_P, _f_, _C_)    _G_DEFINE_TYPE_EXTENDED_BEGIN (TN, t_n, T_P, _f_) {_C_;} _G_DEFINE_TYPE_EXTENDED_END()
                                                            ^
/usr/include/glib-2.0/gobject/gtype.h:1279:43: note: in expansion of macro 'G_DEFINE_TYPE_EXTENDED'
 #define G_DEFINE_TYPE(TN, t_n, T_P)      G_DEFINE_TYPE_EXTENDED (TN, t_n, T_P, 0, {})
                                          ^
nm-pptp-service.c:91:1: note: in expansion of macro 'G_DEFINE_TYPE'
 G_DEFINE_TYPE (NMPptpPppService, nm_pptp_ppp_service, G_TYPE_OBJECT)
 ^
/usr/include/glib-2.0/glib/gmacros.h:162:53: error: typedef '_GStaticAssertCompileTimeAssertion_1' locally defined but not used [-Werror=unused-local-typedefs]
 #define G_STATIC_ASSERT(expr) typedef char G_PASTE (_GStaticAssertCompileTimeAssertion_, __COUNTER__)[(expr) ? 1 : -1]
                                                    ^
/usr/include/glib-2.0/glib/gmacros.h:159:47: note: in definition of macro 'G_PASTE_ARGS'
 #define G_PASTE_ARGS(identifier1,identifier2) identifier1 ## identifier2
                                              ^
/usr/include/glib-2.0/glib/gmacros.h:162:44: note: in expansion of macro 'G_PASTE'
 #define G_STATIC_ASSERT(expr) typedef char G_PASTE (_GStaticAssertCompileTimeAssertion_, __COUNTER__)[(expr) ? 1 : -1]
                                            ^
/usr/include/glib-2.0/glib/gatomic.h:136:5: note: in expansion of macro 'G_STATIC_ASSERT'
    G_STATIC_ASSERT (sizeof *(atomic) == sizeof (gpointer));                \
    ^
/usr/include/glib-2.0/glib/gthread.h:236:7: note: in expansion of macro 'g_atomic_pointer_get'
    (!g_atomic_pointer_get (location) &&                            \
      ^
/usr/include/glib-2.0/gobject/gtype.h:1463:7: note: in expansion of macro 'g_once_init_enter'
  if (g_once_init_enter (&g_define_type_id__volatile))  \
      ^
/usr/include/glib-2.0/gobject/gtype.h:1387:60: note: in expansion of macro '_G_DEFINE_TYPE_EXTENDED_BEGIN'
 #define G_DEFINE_TYPE_EXTENDED(TN, t_n, T_P, _f_, _C_)    _G_DEFINE_TYPE_EXTENDED_BEGIN (TN, t_n, T_P, _f_) {_C_;} _G_DEFINE_TYPE_EXTENDED_END()
                                                            ^
/usr/include/glib-2.0/gobject/gtype.h:1279:43: note: in expansion of macro 'G_DEFINE_TYPE_EXTENDED'
 #define G_DEFINE_TYPE(TN, t_n, T_P)      G_DEFINE_TYPE_EXTENDED (TN, t_n, T_P, 0, {})
                                          ^
nm-pptp-service.c:91:1: note: in expansion of macro 'G_DEFINE_TYPE'
 G_DEFINE_TYPE (NMPptpPppService, nm_pptp_ppp_service, G_TYPE_OBJECT)
 ^
/usr/include/glib-2.0/glib/gmacros.h:162:53: error: typedef '_GStaticAssertCompileTimeAssertion_2' locally defined but not used [-Werror=unused-local-typedefs]
 #define G_STATIC_ASSERT(expr) typedef char G_PASTE (_GStaticAssertCompileTimeAssertion_, __COUNTER__)[(expr) ? 1 : -1]
                                                    ^
/usr/include/glib-2.0/glib/gmacros.h:159:47: note: in definition of macro 'G_PASTE_ARGS'
 #define G_PASTE_ARGS(identifier1,identifier2) identifier1 ## identifier2
                                              ^
/usr/include/glib-2.0/glib/gmacros.h:162:44: note: in expansion of macro 'G_PASTE'
 #define G_STATIC_ASSERT(expr) typedef char G_PASTE (_GStaticAssertCompileTimeAssertion_, __COUNTER__)[(expr) ? 1 : -1]
                                            ^
/usr/include/glib-2.0/glib/gthread.h:241:5: note: in expansion of macro 'G_STATIC_ASSERT'
    G_STATIC_ASSERT (sizeof *(location) == sizeof (gpointer));      \
    ^
/usr/include/glib-2.0/gobject/gtype.h:1477:7: note: in expansion of macro 'g_once_init_leave'
      g_once_init_leave (&g_define_type_id__volatile, g_define_type_id); \
      ^
/usr/include/glib-2.0/gobject/gtype.h:1387:117: note: in expansion of macro '_G_DEFINE_TYPE_EXTENDED_END'
 #define G_DEFINE_TYPE_EXTENDED(TN, t_n, T_P, _f_, _C_)    _G_DEFINE_TYPE_EXTENDED_BEGIN (TN, t_n, T_P, _f_) {_C_;} _G_DEFINE_TYPE_EXTENDED_END()
                                                                                                                    ^
/usr/include/glib-2.0/gobject/gtype.h:1279:43: note: in expansion of macro 'G_DEFINE_TYPE_EXTENDED'
 #define G_DEFINE_TYPE(TN, t_n, T_P)      G_DEFINE_TYPE_EXTENDED (TN, t_n, T_P, 0, {})
                                          ^
nm-pptp-service.c:91:1: note: in expansion of macro 'G_DEFINE_TYPE'
 G_DEFINE_TYPE (NMPptpPppService, nm_pptp_ppp_service, G_TYPE_OBJECT)
 ^
nm-pptp-service.c: In function 'nm_pptp_plugin_get_type':
/usr/include/glib-2.0/glib/gmacros.h:162:53: error: typedef '_GStaticAssertCompileTimeAssertion_3' locally defined but not used [-Werror=unused-local-typedefs]
 #define G_STATIC_ASSERT(expr) typedef char G_PASTE (_GStaticAssertCompileTimeAssertion_, __COUNTER__)[(expr) ? 1 : -1]
                                                    ^
/usr/include/glib-2.0/glib/gmacros.h:159:47: note: in definition of macro 'G_PASTE_ARGS'
 #define G_PASTE_ARGS(identifier1,identifier2) identifier1 ## identifier2
                                              ^
/usr/include/glib-2.0/glib/gmacros.h:162:44: note: in expansion of macro 'G_PASTE'
 #define G_STATIC_ASSERT(expr) typedef char G_PASTE (_GStaticAssertCompileTimeAssertion_, __COUNTER__)[(expr) ? 1 : -1]
                                            ^
/usr/include/glib-2.0/glib/gthread.h:234:5: note: in expansion of macro 'G_STATIC_ASSERT'
    G_STATIC_ASSERT (sizeof *(location) == sizeof (gpointer));      \
    ^
/usr/include/glib-2.0/gobject/gtype.h:1463:7: note: in expansion of macro 'g_once_init_enter'
  if (g_once_init_enter (&g_define_type_id__volatile))  \
      ^
/usr/include/glib-2.0/gobject/gtype.h:1387:60: note: in expansion of macro '_G_DEFINE_TYPE_EXTENDED_BEGIN'
 #define G_DEFINE_TYPE_EXTENDED(TN, t_n, T_P, _f_, _C_)    _G_DEFINE_TYPE_EXTENDED_BEGIN (TN, t_n, T_P, _f_) {_C_;} _G_DEFINE_TYPE_EXTENDED_END()
                                                            ^
/usr/include/glib-2.0/gobject/gtype.h:1279:43: note: in expansion of macro 'G_DEFINE_TYPE_EXTENDED'
 #define G_DEFINE_TYPE(TN, t_n, T_P)      G_DEFINE_TYPE_EXTENDED (TN, t_n, T_P, 0, {})
                                          ^
nm-pptp-service.c:474:1: note: in expansion of macro 'G_DEFINE_TYPE'
 G_DEFINE_TYPE (NMPptpPlugin, nm_pptp_plugin, NM_TYPE_VPN_PLUGIN)
 ^
/usr/include/glib-2.0/glib/gmacros.h:162:53: error: typedef '_GStaticAssertCompileTimeAssertion_4' locally defined but not used [-Werror=unused-local-typedefs]
 #define G_STATIC_ASSERT(expr) typedef char G_PASTE (_GStaticAssertCompileTimeAssertion_, __COUNTER__)[(expr) ? 1 : -1]
                                                    ^
/usr/include/glib-2.0/glib/gmacros.h:159:47: note: in definition of macro 'G_PASTE_ARGS'
 #define G_PASTE_ARGS(identifier1,identifier2) identifier1 ## identifier2
                                              ^
/usr/include/glib-2.0/glib/gmacros.h:162:44: note: in expansion of macro 'G_PASTE'
 #define G_STATIC_ASSERT(expr) typedef char G_PASTE (_GStaticAssertCompileTimeAssertion_, __COUNTER__)[(expr) ? 1 : -1]
                                            ^
/usr/include/glib-2.0/glib/gatomic.h:136:5: note: in expansion of macro 'G_STATIC_ASSERT'
    G_STATIC_ASSERT (sizeof *(atomic) == sizeof (gpointer));                \
    ^
/usr/include/glib-2.0/glib/gthread.h:236:7: note: in expansion of macro 'g_atomic_pointer_get'
    (!g_atomic_pointer_get (location) &&                            \
      ^
/usr/include/glib-2.0/gobject/gtype.h:1463:7: note: in expansion of macro 'g_once_init_enter'
  if (g_once_init_enter (&g_define_type_id__volatile))  \
      ^
/usr/include/glib-2.0/gobject/gtype.h:1387:60: note: in expansion of macro '_G_DEFINE_TYPE_EXTENDED_BEGIN'
 #define G_DEFINE_TYPE_EXTENDED(TN, t_n, T_P, _f_, _C_)    _G_DEFINE_TYPE_EXTENDED_BEGIN (TN, t_n, T_P, _f_) {_C_;} _G_DEFINE_TYPE_EXTENDED_END()
                                                            ^
/usr/include/glib-2.0/gobject/gtype.h:1279:43: note: in expansion of macro 'G_DEFINE_TYPE_EXTENDED'
 #define G_DEFINE_TYPE(TN, t_n, T_P)      G_DEFINE_TYPE_EXTENDED (TN, t_n, T_P, 0, {})
                                          ^
nm-pptp-service.c:474:1: note: in expansion of macro 'G_DEFINE_TYPE'
 G_DEFINE_TYPE (NMPptpPlugin, nm_pptp_plugin, NM_TYPE_VPN_PLUGIN)
 ^
/usr/include/glib-2.0/glib/gmacros.h:162:53: error: typedef '_GStaticAssertCompileTimeAssertion_5' locally defined but not used [-Werror=unused-local-typedefs]
 #define G_STATIC_ASSERT(expr) typedef char G_PASTE (_GStaticAssertCompileTimeAssertion_, __COUNTER__)[(expr) ? 1 : -1]
                                                    ^
/usr/include/glib-2.0/glib/gmacros.h:159:47: note: in definition of macro 'G_PASTE_ARGS'
 #define G_PASTE_ARGS(identifier1,identifier2) identifier1 ## identifier2
                                              ^
/usr/include/glib-2.0/glib/gmacros.h:162:44: note: in expansion of macro 'G_PASTE'
 #define G_STATIC_ASSERT(expr) typedef char G_PASTE (_GStaticAssertCompileTimeAssertion_, __COUNTER__)[(expr) ? 1 : -1]
                                            ^
/usr/include/glib-2.0/glib/gthread.h:241:5: note: in expansion of macro 'G_STATIC_ASSERT'
    G_STATIC_ASSERT (sizeof *(location) == sizeof (gpointer));      \
    ^
/usr/include/glib-2.0/gobject/gtype.h:1477:7: note: in expansion of macro 'g_once_init_leave'
      g_once_init_leave (&g_define_type_id__volatile, g_define_type_id); \
      ^
/usr/include/glib-2.0/gobject/gtype.h:1387:117: note: in expansion of macro '_G_DEFINE_TYPE_EXTENDED_END'
 #define G_DEFINE_TYPE_EXTENDED(TN, t_n, T_P, _f_, _C_)    _G_DEFINE_TYPE_EXTENDED_BEGIN (TN, t_n, T_P, _f_) {_C_;} _G_DEFINE_TYPE_EXTENDED_END()
                                                                                                                    ^
/usr/include/glib-2.0/gobject/gtype.h:1279:43: note: in expansion of macro 'G_DEFINE_TYPE_EXTENDED'
 #define G_DEFINE_TYPE(TN, t_n, T_P)      G_DEFINE_TYPE_EXTENDED (TN, t_n, T_P, 0, {})
                                          ^
nm-pptp-service.c:474:1: note: in expansion of macro 'G_DEFINE_TYPE'
 G_DEFINE_TYPE (NMPptpPlugin, nm_pptp_plugin, NM_TYPE_VPN_PLUGIN)
 ^
cc1: all warnings being treated as errors
make[3]: *** [nm-pptp-service.o] Error 1
make[3]: Leaving directory `/tmp/SBo/NetworkManager-pptp-0.9.4.0/src'
make[2]: *** [all] Error 2
make[2]: Leaving directory `/tmp/SBo/NetworkManager-pptp-0.9.4.0/src'
make[1]: *** [all-recursive] Error 1
make[1]: Leaving directory `/tmp/SBo/NetworkManager-pptp-0.9.4.0'
make: *** [all] Error 2

I trying to build from http://slackbuilds.org/repository/14...kManager-pptp/

willysr 04-08-2013 11:10 AM

Please note that slackbuilds only support stable releases and those bugs will be fixed when new slackware has been released

allend 04-08-2013 11:15 AM

Quote:

cc1: all warnings being treated as errors
I have not tried this, but it looks very similar to the problem in this thread. http://www.linuxquestions.org/questi...nt-4175457003/
volkerdi had some advice there.

anti_user 04-08-2013 12:27 PM

Quote:

Originally Posted by allend (Post 4927598)
I have not tried this, but it looks very similar to the problem in this thread. http://www.linuxquestions.org/questi...nt-4175457003/
volkerdi had some advice there.

much thanks! its helped me :)


All times are GMT -5. The time now is 03:09 AM.