Visit Jeremy's Blog.
Go Back > Forums > Linux Forums > Linux - Distributions > Slackware
User Name
Slackware This Forum is for the discussion of Slackware Linux.


  Search this Thread
Old 10-22-2010, 12:25 PM   #1
LQ Newbie
Registered: Oct 2010
Posts: 5

Rep: Reputation: 0
Unhappy not found slackware-current x64

I am running Slackware x64 current. I just did a slackpkg update and slackpkg upgrade-all.

I am trying to compile the latest kernel and I am getting:

host:/usr/src/linux# make menuconfig
HOSTCC scripts/basic/fixdep
/usr/libexec/gcc/x86_64-slackware-linux/4.5.1/cc1: error while loading shared libraries: cannot open shared object file: No such file or directory
make[1]: *** [scripts/basic/fixdep] Error 1
make: *** [scripts_basic] Error 2

When I try whereis - nothing found? gcc and glibc was one of the packages updated.

I have tried ldconfig. No change there?
Old 10-22-2010, 12:35 PM   #2
Registered: May 2005
Location: Michigan
Distribution: Slackware -current
Posts: 98

Rep: Reputation: 37
To quote the changelog ( ):

l/libelf-0.8.13-x86_64-1.txz: Added.
This is needed to enable LTO support in GCC.

Don't forget to check for new packages added to -current.
Old 10-22-2010, 12:38 PM   #3
Senior Member
Registered: Aug 2004
Location: Pisa, Italy
Distribution: Slackware
Posts: 2,868

Rep: Reputation: 1175Reputation: 1175Reputation: 1175Reputation: 1175Reputation: 1175Reputation: 1175Reputation: 1175Reputation: 1175Reputation: 1175
slackpkg install-new
let you install packages added to -current since the last "upgrade-all".


Thread Tools Search this Thread
Search this Thread:

Advanced Search

Posting Rules
You may not post new threads
You may not post replies
You may not post attachments
You may not edit your posts

BB code is On
Smilies are On
[IMG] code is Off
HTML code is Off

Similar Threads
Thread Thread Starter Forum Replies Last Post
NDISwrapper works for Slackware 13.0 x86 but not Slackware 13.0 x64 - Belkin F5D8053 thewizkid Slackware 0 01-14-2010 07:18 AM
Slackware-Current x64 & x86 + Nvidia SqdnGuns Slackware 7 05-24-2009 11:34 AM
Build Chrome on Slackware-current fail--No package 'nss' found grissiom Slackware 12 09-06-2008 05:43 AM
SLED 10 sp1 x64, RAID 0, GRUB error 17 partition not found. korak SUSE / openSUSE 4 05-04-2008 06:14 PM
DISCUSSION: Upgrade to Slackware -current without a -current CD truthfatal LinuxAnswers Discussion 0 09-19-2006 02:42 PM

All times are GMT -5. The time now is 02:37 AM.

Main Menu
Write for LQ is looking for people interested in writing Editorials, Articles, Reviews, and more. If you'd like to contribute content, let us know.
Main Menu
RSS1  Latest Threads
RSS1  LQ News
Twitter: @linuxquestions
Facebook: linuxquestions Google+: linuxquestions
Open Source Consulting | Domain Registration