LinuxQuestions.org
Register a domain and help support LQ
Go Back   LinuxQuestions.org > Forums > Linux Forums > Linux - Distributions > Slackware
User Name
Password
Slackware This Forum is for the discussion of Slackware Linux.

Notices

Reply
 
Search this Thread
Old 10-06-2003, 09:05 AM   #1
h1tman
Member
 
Registered: Jul 2003
Distribution: Slackware 11
Posts: 439

Rep: Reputation: 30
Kernel Compile error after applyin bootsplash patch


root@darkstar:/usr/src/linux# make bzImage
gcc -D__KERNEL__ -I/usr/src/linux-2.4.22/include -Wall -Wstrict-prototypes -Wno-trigraphs -O2 -fno-strict-aliasing -fno-common -fomit-frame-pointer -pipe -mpreferred-stack-boundary=2 -march=i686 -DKBUILD_BASENAME=main -c -o init/main.o init/main.c
. scripts/mkversion > .tmpversion
gcc -D__KERNEL__ -I/usr/src/linux-2.4.22/include -Wall -Wstrict-prototypes -Wno-trigraphs -O2 -fno-strict-aliasing -fno-common -fomit-frame-pointer -pipe -mpreferred-stack-boundary=2 -march=i686 -DUTS_MACHINE='"i386"' -DKBUILD_BASENAME=version -c -o init/version.o init/version.c
gcc -D__KERNEL__ -I/usr/src/linux-2.4.22/include -Wall -Wstrict-prototypes -Wno-trigraphs -O2 -fno-strict-aliasing -fno-common -fomit-frame-pointer -pipe -mpreferred-stack-boundary=2 -march=i686 -DKBUILD_BASENAME=do_mounts -c -o init/do_mounts.o init/do_mounts.c
make CFLAGS="-D__KERNEL__ -I/usr/src/linux-2.4.22/include -Wall -Wstrict-prototypes -Wno-trigraphs -O2 -fno-strict-aliasing -fno-common -fomit-frame-pointer -pipe -mpreferred-stack-boundary=2 -march=i686 " -C kernel
make[1]: Entering directory `/usr/src/linux-2.4.22/kernel'
make all_targets
make[2]: Entering directory `/usr/src/linux-2.4.22/kernel'
gcc -D__KERNEL__ -I/usr/src/linux-2.4.22/include -Wall -Wstrict-prototypes -Wno-trigraphs -O2 -fno-strict-aliasing -fno-common -fomit-frame-pointer -pipe -mpreferred-stack-boundary=2 -march=i686 -nostdinc -iwithprefix include -DKBUILD_BASENAME=sched -fno-omit-frame-pointer -c -o sched.o sched.c
sched.c: In function `load_balance':
sched.c:1044: structure has no member named `sleep_timestamp'
make[2]: *** [sched.o] Error 1
make[2]: Leaving directory `/usr/src/linux-2.4.22/kernel'
make[1]: *** [first_rule] Error 2
make[1]: Leaving directory `/usr/src/linux-2.4.22/kernel'
make: *** [_dir_kernel] Error 2
 
  


Reply


Thread Tools Search this Thread
Search this Thread:

Advanced Search

Posting Rules
You may not post new threads
You may not post replies
You may not post attachments
You may not edit your posts

BB code is On
Smilies are On
[IMG] code is Off
HTML code is Off


Similar Threads
Thread Thread Starter Forum Replies Last Post
Bootsplash compile error muppski Linux From Scratch 4 11-03-2005 02:11 PM
bootsplash kernel patch for 2.6.12 wil not work CPUFreak91 Linux - Software 2 09-10-2005 01:35 PM
error compiling kernel 2.6.6 with bootsplash patch nagromo Debian 2 12-18-2004 10:51 PM
Kernel 2.6.9 make error (after bootsplash patch) jai_joy Linux - Newbie 7 12-06-2004 02:19 PM
ACPI patch and kernel compile error crisponions Linux - Laptop and Netbook 3 10-29-2003 06:52 PM


All times are GMT -5. The time now is 08:54 AM.

Main Menu
My LQ
Write for LQ
LinuxQuestions.org is looking for people interested in writing Editorials, Articles, Reviews, and more. If you'd like to contribute content, let us know.
Main Menu
Syndicate
RSS1  Latest Threads
RSS1  LQ News
Twitter: @linuxquestions
identi.ca: @linuxquestions
Facebook: linuxquestions Google+: linuxquestions
Open Source Consulting | Domain Registration