LinuxQuestions.org

LinuxQuestions.org (/questions/)
-   Slackware (http://www.linuxquestions.org/questions/slackware-14/)
-   -   error while compiling kernel 2.6.36 in slackware 13.1 -current (http://www.linuxquestions.org/questions/slackware-14/error-while-compiling-kernel-2-6-36-in-slackware-13-1-current-842105/)

el_jauzaa 11-03-2010 08:05 AM

error while compiling kernel 2.6.36 in slackware 13.1 -current
 
hi slackers !

i have problem when i try to compile kernel 2.6.36 in my pc.

#make bzImage

after that i encounter an error like this :

Code:

scripts/kconfig/conf --silentoldconfig arch/x86/Kconfig
  CHK    include/linux/version.h
  CHK    include/generated/utsrelease.h
  CALL    scripts/checksyscalls.sh
  CHK    include/generated/compile.h
  GZIP    kernel/config_data.gz
  IKCFG  kernel/config_data.h
  CC      kernel/configs.o
  LD      kernel/built-in.o
  LD      drivers/ata/built-in.o
  LD      drivers/built-in.o
  LD      vmlinux.o
  MODPOST vmlinux.o
WARNING: modpost: Found 3 section mismatch(es).
To see full details build your kernel with:
'make CONFIG_DEBUG_SECTION_MISMATCH=y'
  GEN    .version
  CHK    include/generated/compile.h
  UPD    include/generated/compile.h                                                                                                                                        CC    init/version.o                                                                                                                                                                     
  LD      init/built-in.o                                                                                                                                                                     
  LD      .tmp_vmlinux1                                                                                                                                                                       
drivers/built-in.o: In function `init_module':
(.text+0x3d4b42): undefined reference to `lirc_register_driver'
drivers/built-in.o: In function `cleanup_module':
(.text+0x3d4bce): undefined reference to `lirc_unregister_driver'
make: *** [.tmp_vmlinux1] Error 1


please enlighten me.


best regards.

udaman 11-03-2010 08:19 AM

Quote:

Originally Posted by el_jauzaa (Post 4147963)
CC kernel/configs.o
LD kernel/built-in.o
LD drivers/ata/built-in.o
LD drivers/built-in.o
LD vmlinux.o
MODPOST vmlinux.o
WARNING: modpost: Found 3 section mismatch(es).
To see full details build your kernel with:
'make CONFIG_DEBUG_SECTION_MISMATCH=y'

GEN .version
CHK include/generated/compile.h
UPD include/generated/compile.h
drivers/built-in.o: In function `init_module':
(.text+0x3d4b42): undefined reference to `lirc_register_driver'
drivers/built-in.o: In function `cleanup_module':
(.text+0x3d4bce): undefined reference to `lirc_unregister_driver'
make: *** [.tmp_vmlinux1] Error 1[/CODE]

Sometimes reading through the output message from make gives clues as to the problem. I suggest you take the advice of the warning above and try again.

mlangdn 11-03-2010 08:23 AM

Check your config and make sure that CONFIG_MODULES=yes is set.

el_jauzaa 11-03-2010 08:29 AM

Quote:

Originally Posted by mlangdn (Post 4147981)
Check your config and make sure that CONFIG_MODULES=yes is set.

it's already 'yes'

el_jauzaa 11-03-2010 06:30 PM

Quote:

Originally Posted by udaman (Post 4147977)
Sometimes reading through the output message from make gives clues as to the problem. I suggest you take the advice of the warning above and try again.

ok. after i run this :

make CONFIG_DEBUG_SECTION_MISMATCH=y

the error is :

Code:

WARNING: vmlinux.o(.data+0x4c4a0): Section mismatch in reference from the variable isp1362_driver to the function .init.text:isp1362_probe()
The variable isp1362_driver references
the function __init isp1362_probe()
If the reference is valid then annotate the
variable with __init* or __refdata (see linux/init.h) or name the variable:
*_template, *_timer, *_sht, *_ops, *_probe, *_probe_one, *_console,

WARNING: vmlinux.o(.data+0x529d0): Section mismatch in reference from the variable intel_mid_dma_pci to the function .devinit.text:intel_mid_dma_probe()
The variable intel_mid_dma_pci references
the function __devinit intel_mid_dma_probe()
If the reference is valid then annotate the
variable with __init* or __refdata (see linux/init.h) or name the variable:
*driver, *_template, *_timer, *_sht, *_ops, *_probe, *_probe_one, *_console,

WARNING: vmlinux.o(.data+0x529d4): Section mismatch in reference from the variable intel_mid_dma_pci to the function .devexit.text:intel_mid_dma_remove()
The variable intel_mid_dma_pci references
the function __devexit intel_mid_dma_remove()
If the reference is valid then annotate the
variable with __exit* (see linux/init.h) or name the variable:
*driver, *_template, *_timer, *_sht, *_ops, *_probe, *_probe_one, *_console,

  GEN    .version
  CHK    include/generated/compile.h
  UPD    include/generated/compile.h
  CC      init/version.o
  LD      init/built-in.o
  LD      .tmp_vmlinux1
drivers/built-in.o: In function `init_module':
(.text+0x3ec2a2): undefined reference to `lirc_register_driver'
drivers/built-in.o: In function `cleanup_module':
(.text+0x3ec32e): undefined reference to `lirc_unregister_driver'
make: *** [.tmp_vmlinux1] Error 1

please enlighten me.


best regards

willysr 11-04-2010 03:23 AM

Try read this solution by Randy Dunlap: http://lkml.org/lkml/2010/11/4/8

MWH 08-29-2012 12:32 PM

kernel compilation error
 
Hi,

I tried to compile 2.6.35.13 kernel as given in this tutorial but um getting an error like this
Code:

  AS      arch/x86/lib/semaphore_32.o
  CC      arch/x86/lib/string_32.o
  CC      arch/x86/lib/strstr_32.o
  AS      arch/x86/lib/thunk_32.o
  CC      arch/x86/lib/usercopy_32.o
  AR      arch/x86/lib/lib.a
  LD      vmlinux.o
  MODPOST vmlinux.o
WARNING: modpost: Found 46 section mismatch(es).
To see full details build your kernel with:
'make CONFIG_DEBUG_SECTION_MISMATCH=y'
  GEN    .version
  CHK    include/generated/compile.h
  UPD    include/generated/compile.h
  CC      init/version.o
  LD      init/built-in.o
  LD      .tmp_vmlinux1
arch/x86/built-in.o: In function `sys_call_table':
(.rodata+0x728): undefined reference to `sys_strcpy'
make: *** [.tmp_vmlinux1] Error 1

What can I do to get rid of this?

Alien Bob 08-29-2012 03:19 PM

Quote:

Originally Posted by MWH (Post 4767553)
Hi,

I tried to compile 2.6.35.13 ....

You are reviving a 2-year dead thread in the Slackware forum for no reason. From your signature it seems you are not even using Slackware. Open your own thread in your own distro's forum instead of violating the dead (I mean, violating LQ etiquette).

Eric

MWH 08-29-2012 08:36 PM

Quote:

You are reviving a 2-year dead thread in the Slackware forum for no reason. From your signature it seems you are not even using Slackware. Open your own thread in your own distro's forum instead of violating the dead (I mean, violating LQ etiquette).
Yeah I already have :)


All times are GMT -5. The time now is 09:30 PM.