LinuxQuestions.org
LinuxAnswers - the LQ Linux tutorial section.
Go Back   LinuxQuestions.org > Forums > Linux Forums > Linux - Distributions > Slackware
User Name
Password
Slackware This Forum is for the discussion of Slackware Linux.

Notices

Reply
 
Search this Thread
Old 07-31-2004, 12:55 AM   #1
BrianJ
LQ Newbie
 
Registered: Jul 2004
Location: Ash, North Carolina
Distribution: Slackware 10.0
Posts: 5

Rep: Reputation: 0
Error when compiling Wine


Everytime I get this error when I do make


Code:
In file included from int13.c:34:
/usr/include/linux/fd.h:342: error: variable or field `__user' declared void
/usr/include/linux/fd.h:342: error: parse error before '*' token
/usr/include/linux/fd.h:360: error: parse error before '}' token
make[2]: *** [int13.o] Error 1
make[2]: Leaving directory `/home/lobo/Desktop/wine-20040716/dlls/winedos'
make[1]: *** [winedos] Error 2
make[1]: Leaving directory `/home/lobo/Desktop/wine-20040716/dlls'
make: *** [dlls] Error 2
 
Old 07-31-2004, 01:22 AM   #2
BrianW
Member
 
Registered: Jul 2003
Location: Montana
Distribution: Slackware
Posts: 247

Rep: Reputation: Disabled
try deleting the un-tared directory and re-un-tar it and see
 
Old 07-31-2004, 01:43 AM   #3
BrianJ
LQ Newbie
 
Registered: Jul 2004
Location: Ash, North Carolina
Distribution: Slackware 10.0
Posts: 5

Original Poster
Rep: Reputation: 0
Already tried didn't work
 
Old 07-31-2004, 02:15 PM   #4
SBing
Member
 
Registered: Mar 2004
Posts: 519

Rep: Reputation: 35
I guess if compiling still hasn't worked you'll have already gone for it - try the Slackware package for it instead, even if it's a precompiled binary it'll still do the job alright :)

What version of slackware / kernel do you have?

Last edited by SBing; 07-31-2004 at 02:16 PM.
 
Old 07-31-2004, 02:22 PM   #5
Cedrik
Senior Member
 
Registered: Jul 2004
Distribution: Slackware
Posts: 2,140

Rep: Reputation: 242Reputation: 242Reputation: 242
And what is your kernel-headers package version ?
 
Old 07-31-2004, 06:00 PM   #6
BrianJ
LQ Newbie
 
Registered: Jul 2004
Location: Ash, North Carolina
Distribution: Slackware 10.0
Posts: 5

Original Poster
Rep: Reputation: 0
2.6.7 the ones that came on slackware 10 disc 2
 
Old 07-31-2004, 11:11 PM   #7
BrianJ
LQ Newbie
 
Registered: Jul 2004
Location: Ash, North Carolina
Distribution: Slackware 10.0
Posts: 5

Original Poster
Rep: Reputation: 0
It seems like there pre packaged Binary is for slackware 9
 
Old 08-01-2004, 12:20 AM   #8
north49er
Member
 
Registered: Apr 2003
Location: 60.47'N lat
Distribution: fedora 15 x86_64
Posts: 156

Rep: Reputation: 18
I downloaded the slack10 wine package from www.linuxpackages.net and it installed no problems. Just read what you need to do before running wine for the first time.
 
Old 08-01-2004, 01:35 AM   #9
Cedrik
Senior Member
 
Registered: Jul 2004
Distribution: Slackware
Posts: 2,140

Rep: Reputation: 242Reputation: 242Reputation: 242
2.6.7 the ones that came on slackware 10 disc 2
Can I suggest you to not use the kernel-header 2.7 package because it is a little too new for some software to properly compile. Try the 2.4 kernel-header instead. Be quiet, this package provides header files (.h files) wich does not affect the whole system at all if kernel version does not match, even to compile modules, because the compiler will look at /usr/lib/$(uname -r)/build and not in /usr/include/linux.
 
Old 08-01-2004, 06:50 PM   #10
BrianJ
LQ Newbie
 
Registered: Jul 2004
Location: Ash, North Carolina
Distribution: Slackware 10.0
Posts: 5

Original Poster
Rep: Reputation: 0
Fixed thanks Cedrik
 
  


Reply


Thread Tools Search this Thread
Search this Thread:

Advanced Search

Posting Rules
You may not post new threads
You may not post replies
You may not post attachments
You may not edit your posts

BB code is On
Smilies are On
[IMG] code is Off
HTML code is Off


Similar Threads
Thread Thread Starter Forum Replies Last Post
Trouble running wine from src wine:error while loading shared libraries: libwine.so.1 brynjarh Linux - Newbie 2 05-28-2013 10:59 AM
Just finished compiling Wine, getting "couldn't find program" error Maronflower Linux - Software 1 11-10-2003 06:50 PM
Compiling Wine Catalyc Linux - Software 1 12-27-2002 09:12 PM
wine compiling and error 2 watashiwaotaku7 Linux - Software 2 12-25-2002 09:33 PM
help compiling wine! tonyh Linux - General 3 05-28-2002 03:22 AM


All times are GMT -5. The time now is 01:58 PM.

Main Menu
My LQ
Write for LQ
LinuxQuestions.org is looking for people interested in writing Editorials, Articles, Reviews, and more. If you'd like to contribute content, let us know.
Main Menu
Syndicate
RSS1  Latest Threads
RSS1  LQ News
Twitter: @linuxquestions
identi.ca: @linuxquestions
Facebook: linuxquestions Google+: linuxquestions
Open Source Consulting | Domain Registration