LinuxQuestions.org
Share your knowledge at the LQ Wiki.
Go Back   LinuxQuestions.org > Forums > Linux Forums > Linux - Distributions > Slackware
User Name
Password
Slackware This Forum is for the discussion of Slackware Linux.

Notices



Reply
 
Search this Thread
Old 11-11-2005, 04:21 PM   #1
bmfan
Member
 
Registered: Mar 2005
Posts: 74

Rep: Reputation: 15
error building kdebase


Im trying to build kde, I have arts and kdelibs built and installed. Im working on kdebase now and i get this error
Code:
then mv -f ".deps/joystick.Tpo" ".deps/joystick.Plo"; else rm -f ".deps/joystick.Tpo"; exit 1; fi
In file included from joydevice.h:26,
                 from joystick.cpp:29:
/usr/include/linux/joystick.h:131: error: `__s64' does not name a type
/usr/include/linux/joystick.h:132: error: `__s64' does not name a type
In file included from joydevice.h:26,
                 from joystick.cpp:29:
/usr/include/linux/joystick.h:142:2: #error Unexpected BITS_PER_LONG
make[3]: *** [joystick.lo] Error 1
make[3]: Leaving directory `/home/bmfan/Desktop/build/kdebase/kdebase-3.4.3/kcontrol/joystick'
make[2]: *** [all-recursive] Error 1
make[2]: Leaving directory `/home/bmfan/Desktop/build/kdebase/kdebase-3.4.3/kcontrol'
make[1]: *** [all-recursive] Error 1
make[1]: Leaving directory `/home/bmfan/Desktop/build/kdebase/kdebase-3.4.3'
make: *** [all] Error 2
Ive look at the files and ive googled for that error, I havent been able to find anything on it . any ideas on how to solve this ?
 
Old 11-12-2005, 09:51 AM   #2
egag
Senior Member
 
Registered: Jul 2004
Location: Netherlands
Distribution: Slackware
Posts: 2,721

Rep: Reputation: 52
install the original kernel-headers. ( and remove the ones you installed )

egag
 
  


Reply


Thread Tools Search this Thread
Search this Thread:

Advanced Search

Posting Rules
You may not post new threads
You may not post replies
You may not post attachments
You may not edit your posts

BB code is On
Smilies are On
[IMG] code is Off
HTML code is Off


Similar Threads
Thread Thread Starter Forum Replies Last Post
kdebase-3.3.2 'make error' bendeco13 Linux - General 1 02-17-2005 04:34 AM
konq_poppup.cc error while building kdebase AtroxAngel Linux - Software 1 02-02-2005 12:34 AM
emerging kdebase error LuckyABA Linux - Newbie 4 01-21-2005 01:01 AM
Error while building kernel linuxboy69 Linux - Software 10 08-26-2004 01:09 PM
mpegrec building error jinneemop Linux - General 2 04-27-2003 01:03 AM


All times are GMT -5. The time now is 08:42 PM.

Main Menu
Advertisement
My LQ
Write for LQ
LinuxQuestions.org is looking for people interested in writing Editorials, Articles, Reviews, and more. If you'd like to contribute content, let us know.
Main Menu
Syndicate
RSS1  Latest Threads
RSS1  LQ News
Twitter: @linuxquestions
identi.ca: @linuxquestions
Facebook: linuxquestions Google+: linuxquestions
Open Source Consulting | Domain Registration