-   Slackware (
-   -   error building glade3 slackbuild? (

trademark91 01-21-2011 07:31 PM

error building glade3 slackbuild?
hey all, im trying to build the glade3 slackbuild on slackware x64 -current, but everytime i try to build it, i get the same error:


/usr/lib/ could not read symbols: File in wrong format
collect2: ld returned 1 exit status
make[3]: *** [] Error 1
make[3]: Leaving directory `/tmp/SBo/glade3-3.6.7/plugins/python'
make[2]: *** [all-recursive] Error 1
make[2]: Leaving directory `/tmp/SBo/glade3-3.6.7/plugins'
make[1]: *** [all-recursive] Error 1
make[1]: Leaving directory `/tmp/SBo/glade3-3.6.7'
make: *** [all] Error 2

there are no dependencies listed in the slackbuild, so i'm confused as to what could be causing this error. any ideas?

andrew.46 01-21-2011 07:49 PM

Glade3 from builds fine on 32bit -current. I have the following:


root@skamandros/home/andrew# find /usr/lib -iname 'libgtk*'

trademark91 01-21-2011 07:55 PM

must be an error with 64 bit then?

piratesmack 01-21-2011 10:35 PM

I noticed that there is a glade3 package and slackbuild in the deps directory for Robby's Xfce 4.8 packages

You may want to give that a try instead.

I maintain the glade3 SlackBuild on SBo, but have only tested it on 13.1.

disturbed1 01-21-2011 11:14 PM

Are you using multilib? If so try passing LDFLAGS

./configure \

Confirmed adding LDFLAGS fixes the compile error.

trademark91 01-21-2011 11:31 PM

^^ did the trick. thank you!

All times are GMT -5. The time now is 08:33 AM.