LinuxQuestions.org
LinuxAnswers - the LQ Linux tutorial section.
Go Back   LinuxQuestions.org > Forums > Linux Forums > Linux - Distributions > Red Hat
User Name
Password
Red Hat This forum is for the discussion of Red Hat Linux.

Notices

Reply
 
Search this Thread
Old 07-15-2004, 05:18 AM   #1
nkjsat2
LQ Newbie
 
Registered: Jul 2004
Posts: 3

Rep: Reputation: 0
redhat enterprise WS xine build error


i got this error while building xine-lib.Any ideas?

dt_keeper.c:188: warning: `struct modify_ldt_ldt_s'
declared inside parameter list
ldt_keeper.c:188: warning: its scope is only this
definition or declaration, which is probably not what
you want
ldt_keeper.c:189: parameter `array' has incomplete
type
ldt_keeper.c: In function `_modify_ldt':
ldt_keeper.c:193: sizeof applied to an incomplete type
ldt_keeper.c: In function `Setup_LDT_Keeper':
ldt_keeper.c:245: storage size of `array' isn't known
ldt_keeper.c:245: warning: unused variable `array'
ldt_keeper.c: In function `Restore_LDT_Keeper':
ldt_keeper.c:338: storage size of `array' isn't known
ldt_keeper.c:360: sizeof applied to an incomplete type
ldt_keeper.c:360: sizeof applied to an incomplete type
ldt_keeper.c:360: sizeof applied to an incomplete type
ldt_keeper.c:360: sizeof applied to an incomplete type
ldt_keeper.c:360: sizeof applied to an incomplete type
ldt_keeper.c:360: sizeof applied to an incomplete type
ldt_keeper.c:338: warning: unused variable `array'
make[4]: *** [ldt_keeper.lo] Error 1
make[4]: Leaving directory
`/home/xxxx/redhat/BUILD/xine-lib-1-cvs/src/libw32dll/wine'
make[3]: *** [all-recursive] Error 1
make[3]: Leaving directory
`/home/xxxx/redhat/BUILD/xine-lib-1-cvs/src/libw32dll'
make[2]: *** [all-recursive] Error 1
make[2]: Leaving directory
`/home/xxxx/redhat/BUILD/xine-lib-1-cvs/src'
make[1]: *** [all-recursive] Error 1
make[1]: Leaving directory
`/home/xxxx/redhat/BUILD/xine-lib-1-cvs'
make: *** [all] Error 2
error: Bad exit status from /var/tmp/rpm-tmp.84594
(%build)


RPM build errors:
Bad exit status from /var/tmp/rpm-tmp.84594
(%build)



same error with rc4 rc5 and 03042004cvs
 
Old 07-15-2004, 04:34 PM   #2
oldskool
Newbie
 
Registered: Jul 2004
Posts: 21

Rep: Reputation: 15
Grab apt for RHEL (3, I assume) here

http://dag.wieers.com/packages/apt/

then

apt-get install xine
 
Old 07-19-2004, 11:08 PM   #3
jhibbets
Red Hat
 
Registered: Sep 2003
Location: Raleigh, NC
Distribution: Red Hat Enterprise Linux v 2.1, v 3, v 4
Posts: 174

Rep: Reputation: 30
I had a world of problem installing Xine on WS. It was a minimal install b/c it was a laptop. I updated as many packages as I could, had to get all the compilers that I was missing and so forth. If you can, you may just want to do an everything install (if you have that option).

I used the Xine rpm and once I solved all my depenedency issues, then I had to find some other packages to install (to make things better) and it was OK.

All in all, I really can't help you with those exact errors (although they kinda look like windows directory strucutres a bit), but I can say that 3 hours, a lot of RPM installs, and I finally got it working.
 
Old 07-22-2004, 08:10 PM   #4
nkjsat2
LQ Newbie
 
Registered: Jul 2004
Posts: 3

Original Poster
Rep: Reputation: 0
glibc-kernheaders )))))))))))))))))))))))) i didn't install it when it said some conflicts.Now i installed is and problem solved.
 
  


Reply


Thread Tools Search this Thread
Search this Thread:

Advanced Search

Posting Rules
You may not post new threads
You may not post replies
You may not post attachments
You may not edit your posts

BB code is On
Smilies are On
[IMG] code is Off
HTML code is Off


Similar Threads
Thread Thread Starter Forum Replies Last Post
display horizantly shifted for redhat 9.0, redhat enterprise and fedora core dudely Linux - Enterprise 3 08-13-2005 12:28 PM
display horizantly shifted for redhat 9.0, redhat enterprise and fedora core dudely Linux - Software 3 08-12-2005 10:18 AM
display horizantly shifted for redhat 9.0, redhat enterprise and fedora core dudely Linux - Newbie 1 08-11-2005 04:11 PM
Redhat Enterprise AS, php-mysql-4.3.3-4.1.i386.rpm, mysql_connect() error apradhan Linux - Distributions 0 02-18-2004 03:11 PM
Xine build probs kanun Linux - Software 5 08-22-2003 03:56 AM


All times are GMT -5. The time now is 01:42 AM.

Main Menu
My LQ
Write for LQ
LinuxQuestions.org is looking for people interested in writing Editorials, Articles, Reviews, and more. If you'd like to contribute content, let us know.
Main Menu
Syndicate
RSS1  Latest Threads
RSS1  LQ News
Twitter: @linuxquestions
identi.ca: @linuxquestions
Facebook: linuxquestions Google+: linuxquestions
Open Source Consulting | Domain Registration