LinuxQuestions.org

LinuxQuestions.org (/questions/)
-   Red Hat (http://www.linuxquestions.org/questions/red-hat-31/)
-   -   redhat enterprise WS xine build error (http://www.linuxquestions.org/questions/red-hat-31/redhat-enterprise-ws-xine-build-error-205299/)

nkjsat2 07-15-2004 05:18 AM

redhat enterprise WS xine build error
 
i got this error while building xine-lib.Any ideas?

dt_keeper.c:188: warning: `struct modify_ldt_ldt_s'
declared inside parameter list
ldt_keeper.c:188: warning: its scope is only this
definition or declaration, which is probably not what
you want
ldt_keeper.c:189: parameter `array' has incomplete
type
ldt_keeper.c: In function `_modify_ldt':
ldt_keeper.c:193: sizeof applied to an incomplete type
ldt_keeper.c: In function `Setup_LDT_Keeper':
ldt_keeper.c:245: storage size of `array' isn't known
ldt_keeper.c:245: warning: unused variable `array'
ldt_keeper.c: In function `Restore_LDT_Keeper':
ldt_keeper.c:338: storage size of `array' isn't known
ldt_keeper.c:360: sizeof applied to an incomplete type
ldt_keeper.c:360: sizeof applied to an incomplete type
ldt_keeper.c:360: sizeof applied to an incomplete type
ldt_keeper.c:360: sizeof applied to an incomplete type
ldt_keeper.c:360: sizeof applied to an incomplete type
ldt_keeper.c:360: sizeof applied to an incomplete type
ldt_keeper.c:338: warning: unused variable `array'
make[4]: *** [ldt_keeper.lo] Error 1
make[4]: Leaving directory
`/home/xxxx/redhat/BUILD/xine-lib-1-cvs/src/libw32dll/wine'
make[3]: *** [all-recursive] Error 1
make[3]: Leaving directory
`/home/xxxx/redhat/BUILD/xine-lib-1-cvs/src/libw32dll'
make[2]: *** [all-recursive] Error 1
make[2]: Leaving directory
`/home/xxxx/redhat/BUILD/xine-lib-1-cvs/src'
make[1]: *** [all-recursive] Error 1
make[1]: Leaving directory
`/home/xxxx/redhat/BUILD/xine-lib-1-cvs'
make: *** [all] Error 2
error: Bad exit status from /var/tmp/rpm-tmp.84594
(%build)


RPM build errors:
Bad exit status from /var/tmp/rpm-tmp.84594
(%build)



same error with rc4 rc5 and 03042004cvs

oldskool 07-15-2004 04:34 PM

Grab apt for RHEL (3, I assume) here

http://dag.wieers.com/packages/apt/

then

apt-get install xine

jhibbets 07-19-2004 11:08 PM

I had a world of problem installing Xine on WS. It was a minimal install b/c it was a laptop. I updated as many packages as I could, had to get all the compilers that I was missing and so forth. If you can, you may just want to do an everything install (if you have that option).

I used the Xine rpm and once I solved all my depenedency issues, then I had to find some other packages to install (to make things better) and it was OK.

All in all, I really can't help you with those exact errors (although they kinda look like windows directory strucutres a bit), but I can say that 3 hours, a lot of RPM installs, and I finally got it working.

nkjsat2 07-22-2004 08:10 PM

glibc-kernheaders :))))))))))))))))))))))))) i didn't install it when it said some conflicts.Now i installed is and problem solved.


All times are GMT -5. The time now is 02:28 AM.