Register a domain and help support LQ
Go Back > Forums > Linux Forums > Linux - Distributions > Red Hat
User Name
Red Hat This forum is for the discussion of Red Hat Linux.


  Search this Thread
Old 01-07-2006, 04:42 PM   #1
Registered: Dec 2003
Location: Overgaard, AZ
Distribution: Suse 10.0, FC5, RHEL4
Posts: 32

Rep: Reputation: 15
konstruct dies install kde3.5 because of knight

konstruct dies when trying to compile knight. I really don't care about this game but because it will not compile due to code errors I cannot proceed and complete a "make install" with everything. Is there a way to tell konstruct to not build this game and go on and finish making 3.5?

g++ -DHAVE_CONFIG_H -I. -I. -I.. -I/usr/local/kde/kde3.4-beta2/include -I/usr/X11R6/include -DQT_THREAD_SUPPORT -I/usr/local/kde/kde3.4-beta2/include -I/usr/X11R6/include -I/usr/local/kde/kde3.4-beta2/include -I/usr/X11R6/include -D_REENTRANT -Wnon-virtual-dtor -Wno-long-long -Wundef -Wall -pedantic -W -Wpointer-arith -Wmissing-prototypes -Wwrite-strings -ansi -D_XOPEN_SOURCE=500 -D_BSD_SOURCE -Wcast-align -Wconversion -O2 -I/usr/local/kde/kde3.4-beta2/include -I/usr/X11R6/include -L/usr/local/kde/kde3.4-beta2/lib -L/usr/X11R6/lib -O2 -pipe -fomit-frame-pointer -march=pentium4 -I/usr/local/kde/kde3.4-beta2/include -I/usr/X11R6/include -L/usr/local/kde/kde3.4-beta2/lib -L/usr/X11R6/lib -O2 -pipe -fomit-frame-pointer -march=pentium4 -fno-exceptions -fno-check-new -c -o core.o `test -f core.cpp || echo './'`core.cpp
cc1plus: warning: command line option "-Wmissing-prototypes" is valid for Ada/C/ObjC but not for C++
core.cpp: In member function `void core::createNewIO(int, int, int, int)':
core.cpp:93: error: ISO C++ forbids cast to non-reference type used as lvalue
core.cpp:117: error: ISO C++ forbids cast to non-reference type used as lvalue
core.cpp:122: error: ISO C++ forbids cast to non-reference type used as lvalue
make[4]: *** [core.o] error 1
make[4]: Leaving directory `/home/maroni/download/systemowe/konstruct/apps/games/knights/work/knights-0.6/knights'
make[3]: *** [all-recursive] error 1
make[3]: Leaving directory `/home/maroni/download/systemowe/konstruct/apps/games/knights/work/knights-0.6'
make[2]: *** [all] error 2
make[2]: Leaving directory `/home/maroni/download/systemowe/konstruct/apps/games/knights/work/knights-0.6'
make[1]: *** [build-work/knights-0.6/Makefile] error 2
make[1]: Leaving directory `/home/maroni/download/systemowe/konstruct/apps/games/knights'
make: *** [dep-../../apps/games/knights] error 2
[root@localhost everything]#


Thread Tools Search this Thread
Search this Thread:

Advanced Search

Posting Rules
You may not post new threads
You may not post replies
You may not post attachments
You may not edit your posts

BB code is On
Smilies are On
[IMG] code is Off
HTML code is Off

Similar Threads
Thread Thread Starter Forum Replies Last Post
Running Jedi Knight with Wine, wont detect CD Niteskye Linux - Games 4 07-30-2005 10:49 AM
KDE 3.4 Install using Konstruct cornish Linux - Software 6 05-09-2005 03:48 PM
How to install KDE after konstruct is finished? alexchannell Linux - Software 3 08-06-2004 05:51 PM
Kde3.2.2 upgrade using konstruct juzchillin Linux - Software 1 05-10-2004 06:59 PM
Konstruct install of KDE3.2 on Knoppix installed to HD--will it work? alxdotnet Linux - Distributions 3 02-10-2004 11:45 PM

All times are GMT -5. The time now is 01:53 PM.

Main Menu
Write for LQ is looking for people interested in writing Editorials, Articles, Reviews, and more. If you'd like to contribute content, let us know.
Main Menu
RSS1  Latest Threads
RSS1  LQ News
Twitter: @linuxquestions
Facebook: linuxquestions Google+: linuxquestions
Open Source Consulting | Domain Registration